{"text_format":"1","workbook":"xlsx","n_sheets":7,"sheets":["w","CC","B","ww","Sheet2","R","C"],"not_rendered":{"charts":0,"images":0,"macros":1,"external_links":2,"defined_names":5,"comments":0,"pivot_tables":0},"unopened":[],"bounds":{"document_bytes":16777216,"sheet_cells":100000,"rows_first":2000,"rows_last":500,"rows_between":2000,"halvings":0,"cell_chars":16384,"cell_head_chars":4096},"cells_cut":0,"cells_raw":0,"read":"whole","date_system":"1900"}

{"sheet":"w","index":0,"n_rows":208,"n_cols":36,"rows_kept":208,"cut":false,"hidden":false,"merged":[]}
["ردیف","مقطع","رشته","گرایش","دوره","نام درس","تعداد واحد","نام استاد","نام خانوادگی استاد","ترم برگزاری","دانشجوی ترم چندمی","ترم ورود دانشجو","گروه ارائه دهنده","روز برگزاری","ساعت برگزاری","محل کلاس","کمک مدرس (ویژه آموزش الکترونیکی)","روز امتحان","ساعت امتحان","محل امتحان","شنبه","یکشنبه","دوشنبه","سه شنبه","چهارشنبه","پنج شنبه","توضیحات","روز 1","روز2","روز3","ساعت 1","ساعت 2","ساعت 3","کلاس1","کلاس2","عنوان کامل"]
[{"$f":"ROWS(A$2:C2)","v":1},"كارشناسي ارشد","علوم اقتصادی","برنامه ريزي سيستمهاي اقتصادي","روزانه","اقتصاد سنجي ( جبرانی )","3",null,"شوال پور",3982,"ترم 02",3981,"پیشرفت اقتصادی",{"$f":"CONCATENATE('C'!O2,CHAR(10),'C'!P2)","v":"شنبه\nسه شنبه"},{"$f":"CONCATENATE('C'!Q2,CHAR(10),'C'!R2)","v":"13-15\n10-12"},{"$f":"CONCATENATE(AH2,CHAR(10),AI2)","v":"207\n208"},null,"99/03/25","8",null,"13-15",null,null,"10-12",null,null,null,"شنبه","سه شنبه",null,{"$f":"'C'!Q2","v":"13-15"},{"$f":"'C'!R2","v":"10-12"},null,207,"208",{"$f":"CONCATENATE(\"رشته: \",C2,\"-\",\" گرایش: \",D2,\" - \",B2,\" - دانشجویان \",K2,\" - \",E2)","v":"رشته: علوم اقتصادی- گرایش: برنامه ريزي سيستمهاي اقتصادي - كارشناسي ارشد - دانشجویان ترم 02 - روزانه"}]
[{"$f":"ROWS(A$2:C3)","v":2},"كارشناسي ارشد","علوم اقتصادی","برنامه ريزي سيستمهاي اقتصادي","روزانه","اقتصاد كلان",{"$f":"VLOOKUP(F3,[2]Sheet1!$M:$N,2,FALSE)","v":4},null,"رفیعی",3982,"ترم 02",3981,"پیشرفت اقتصادی",{"$f":"CONCATENATE('C'!O3,CHAR(10),'C'!P3)","v":"شنبه\nسه شنبه"},{"$f":"CONCATENATE('C'!Q3,CHAR(10),'C'!R3)","v":"10-12\n15-17"},"207\n208",null,"99/03/27","8",null,"10-12",null,null,"15-17",null,null,null,{"$f":"'C'!O3","v":"شنبه"},{"$f":"'C'!P3","v":"سه شنبه"},null,{"$f":"'C'!Q3","v":"10-12"},{"$f":"'C'!R3","v":"15-17"},null,"207","208","رشته: علوم اقتصادی- گرایش: برنامه ريزي سيستمهاي اقتصادي - كارشناسي ارشد - دانشجویان ترم 02 - روزانه"]
[{"$f":"ROWS(A$2:C4)","v":3},"كارشناسي ارشد","علوم اقتصادی","برنامه ريزي سيستمهاي اقتصادي","روزانه","تحلیل تصمیم گیری",3,null,"کرمانی",3982,"ترم 02",3981,"پیشرفت اقتصادی",{"$f":"CONCATENATE('C'!O4,CHAR(10),'C'!P4)","v":"شنبه\nسه شنبه"},{"$f":"CONCATENATE('C'!Q4,CHAR(10),'C'!R4)","v":"15-17\n13-15"},"207\n208",null,"99/03/31","8",null,"15-17",null,null,"13-15",null,null,null,{"$f":"'C'!O4","v":"شنبه"},{"$f":"'C'!P4","v":"سه شنبه"},null,{"$f":"'C'!Q4","v":"15-17"},{"$f":"'C'!R4","v":"13-15"},null,"207","208","رشته: علوم اقتصادی- گرایش: برنامه ريزي سيستمهاي اقتصادي - كارشناسي ارشد - دانشجویان ترم 02 - روزانه"]
[{"$f":"ROWS(A$2:C5)","v":4},"كارشناسي ارشد","علوم اقتصادی","برنامه ريزي سيستمهاي اقتصادي","روزانه","سيستمهاي ديناميكي1",{"$f":"VLOOKUP(F5,[2]Sheet1!$M:$N,2,FALSE)","v":3},null,"پارسانژاد",3982,"ترم 02",3981,"پیشرفت اقتصادی",{"$f":"CONCATENATE('C'!O5,CHAR(10),'C'!P5)","v":"شنبه\nسه شنبه"},{"$f":"CONCATENATE('C'!Q5,CHAR(10),'C'!R5)","v":"8-10\n8-10"},"207\n207",null,"99/04/04","8",null,"8-10",null,null,"8-10",null,null,null,{"$f":"'C'!O5","v":"شنبه"},{"$f":"'C'!P5","v":"سه شنبه"},null,{"$f":"'C'!Q5","v":"8-10"},{"$f":"'C'!R5","v":"8-10"},null,"207","207","رشته: علوم اقتصادی- گرایش: برنامه ريزي سيستمهاي اقتصادي - كارشناسي ارشد - دانشجویان ترم 02 - روزانه"]
[{"$f":"ROWS(A$2:C6)","v":5},"كارشناسي ارشد","علوم اقتصادی","برنامه ريزي سيستمهاي اقتصادي","روزانه","پایان نامه",6,null,null,3982,"ترم 04 و بیشتر","3971 و قبل تر","پیشرفت اقتصادی",{"$f":"CONCATENATE('C'!O6,CHAR(10),'C'!P6)","v":"\n"},{"$f":"CONCATENATE('C'!Q6,CHAR(10),'C'!R6)","v":"\n"},"\n-",null,null,null,null,null,null,null,null,null,null,null,{"$f":"'C'!O6","v":""},{"$f":"'C'!P6","v":""},null,{"$f":"'C'!Q6","v":""},{"$f":"'C'!R6","v":""},null,"","-","رشته: علوم اقتصادی- گرایش: برنامه ريزي سيستمهاي اقتصادي - كارشناسي ارشد - دانشجویان ترم 04 و بیشتر - روزانه"]
[{"$f":"ROWS(A$2:C7)","v":6},"كارشناسي ارشد","علوم اقتصادی","توسعه اقتصادي و برنامه ريزي","روزانه","اقتصاد خرد",{"$f":"VLOOKUP(F7,[2]Sheet1!$M:$N,2,FALSE)","v":4},null,"رفیعی",3982,"ترم 02",3981,"پیشرفت اقتصادی",{"$f":"CONCATENATE('C'!O7,CHAR(10),'C'!P7)","v":"شنبه\nدوشنبه"},{"$f":"CONCATENATE('C'!Q7,CHAR(10),'C'!R7)","v":"8-10\n8-10"},"208\n208",null,"99/03/27","8",null,"8-10",null,"8-10",null,null,null,null,{"$f":"'C'!O7","v":"شنبه"},{"$f":"'C'!P7","v":"دوشنبه"},null,{"$f":"'C'!Q7","v":"8-10"},{"$f":"'C'!R7","v":"8-10"},null,"208","208","رشته: علوم اقتصادی- گرایش: توسعه اقتصادي و برنامه ريزي - كارشناسي ارشد - دانشجویان ترم 02 - روزانه"]
[{"$f":"ROWS(A$2:C8)","v":7},"كارشناسي ارشد","علوم اقتصادی","توسعه اقتصادي و برنامه ريزي","روزانه","سیاستگذاری در بخش صنعت","3",null,"محمدپور عمران",3982,"ترم 02",3981,"پیشرفت اقتصادی",{"$f":"CONCATENATE('C'!O8,CHAR(10),'C'!P8)","v":"شنبه\nدوشنبه"},{"$f":"CONCATENATE('C'!Q8,CHAR(10),'C'!R8)","v":"13-15\n13-15"},"208\n208",null,"99/03/31","8",null,"13-15",null,"13-15",null,null,null,null,{"$f":"'C'!O8","v":"شنبه"},{"$f":"'C'!P8","v":"دوشنبه"},null,{"$f":"'C'!Q8","v":"13-15"},{"$f":"'C'!R8","v":"13-15"},null,"208","208","رشته: علوم اقتصادی- گرایش: توسعه اقتصادي و برنامه ريزي - كارشناسي ارشد - دانشجویان ترم 02 - روزانه"]
[{"$f":"ROWS(A$2:C9)","v":8},"كارشناسي ارشد","علوم اقتصادی","توسعه اقتصادي و برنامه ريزي","روزانه","اقتصاد كلان",{"$f":"VLOOKUP(F9,[2]Sheet1!$M:$N,2,FALSE)","v":4},null,"ابوالحسنی",3982,"ترم 02",3981,"پیشرفت اقتصادی",{"$f":"CONCATENATE('C'!O9,CHAR(10),'C'!P9)","v":"شنبه\nدوشنبه"},{"$f":"CONCATENATE('C'!Q9,CHAR(10),'C'!R9)","v":"15-17\n15-17"},"208\n208",null,"99/04/04","8",null,"15-17",null,"15-17",null,null,null,null,{"$f":"'C'!O9","v":"شنبه"},{"$f":"'C'!P9","v":"دوشنبه"},null,{"$f":"'C'!Q9","v":"15-17"},{"$f":"'C'!R9","v":"15-17"},null,"208","208","رشته: علوم اقتصادی- گرایش: توسعه اقتصادي و برنامه ريزي - كارشناسي ارشد - دانشجویان ترم 02 - روزانه"]
[{"$f":"ROWS(A$2:C10)","v":9},"كارشناسي ارشد","علوم اقتصادی","توسعه اقتصادي و برنامه ريزي","روزانه","پایان نامه",6,null,null,3982,"ترم 04 و بیشتر","3971 و قبل تر","پیشرفت اقتصادی",{"$f":"CONCATENATE('C'!O10,CHAR(10),'C'!P10)","v":"\n"},{"$f":"CONCATENATE('C'!Q10,CHAR(10),'C'!R10)","v":"\n"},"\n-",null,null,null,null,null,null,null,null,null,null,null,{"$f":"'C'!O10","v":""},{"$f":"'C'!P10","v":""},null,{"$f":"'C'!Q10","v":""},{"$f":"'C'!R10","v":""},null,"","-","رشته: علوم اقتصادی- گرایش: توسعه اقتصادي و برنامه ريزي - كارشناسي ارشد - دانشجویان ترم 04 و بیشتر - روزانه"]
[{"$f":"ROWS(A$2:C11)","v":10},"كارشناسي ارشد","مهندسي صنايع","سيستمهاي كلان","روزانه","اقتصاد كلان پيشرفته",{"$f":"VLOOKUP(F11,[2]Sheet1!$M:$N,2,FALSE)","v":3},null,"میرزامحمدی",3982,"ترم 02",3981,"پیشرفت اقتصادی",{"$f":"CONCATENATE('C'!O11,CHAR(10),'C'!P11)","v":"یکشنبه\nسه شنبه"},{"$f":"CONCATENATE('C'!Q11,CHAR(10),'C'!R11)","v":"8-10\n8-10"},"207\n208",null,"99/04/02","8",null,null,"8-10",null,"8-10",null,null,null,{"$f":"'C'!O11","v":"یکشنبه"},{"$f":"'C'!P11","v":"سه شنبه"},null,{"$f":"'C'!Q11","v":"8-10"},{"$f":"'C'!R11","v":"8-10"},null,"207","208","رشته: مهندسي صنايع- گرایش: سيستمهاي كلان - كارشناسي ارشد - دانشجویان ترم 02 - روزانه"]
[{"$f":"ROWS(A$2:C12)","v":11},"كارشناسي ارشد","مهندسي صنايع","سيستمهاي كلان","روزانه","داده كاوي: مدلها، الگوريتمها و كاربردها",{"$f":"VLOOKUP(F12,[2]Sheet1!$M:$N,2,FALSE)","v":3},null,"رسولی",3982,"ترم 02",3981,"پیشرفت اقتصادی",{"$f":"CONCATENATE('C'!O12,CHAR(10),'C'!P12)","v":"یکشنبه\nسه شنبه"},{"$f":"CONCATENATE('C'!Q12,CHAR(10),'C'!R12)","v":"10-12\n10-12"},"207\n207",null,"99/03/26","8",null,null,"10-12",null,"10-12",null,null,null,{"$f":"'C'!O12","v":"یکشنبه"},{"$f":"'C'!P12","v":"سه شنبه"},null,{"$f":"'C'!Q12","v":"10-12"},{"$f":"'C'!R12","v":"10-12"},null,"207","207","رشته: مهندسي صنايع- گرایش: سيستمهاي كلان - كارشناسي ارشد - دانشجویان ترم 02 - روزانه"]
[{"$f":"ROWS(A$2:C13)","v":12},"كارشناسي ارشد","مهندسي صنايع","سيستمهاي كلان","روزانه","مدلسازي پوياييهاي سيستم",{"$f":"VLOOKUP(F13,[2]Sheet1!$M:$N,2,FALSE)","v":3},null,"پارسانژاد",3982,"ترم 02",3981,"پیشرفت اقتصادی",{"$f":"CONCATENATE('C'!O13,CHAR(10),'C'!P13)","v":"یکشنبه\nسه شنبه"},{"$f":"CONCATENATE('C'!Q13,CHAR(10),'C'!R13)","v":"13-15\n13-15"},"207\n207",null,"99/04/04","8",null,null,"13-15",null,"13-15",null,null,null,{"$f":"'C'!O13","v":"یکشنبه"},{"$f":"'C'!P13","v":"سه شنبه"},null,{"$f":"'C'!Q13","v":"13-15"},{"$f":"'C'!R13","v":"13-15"},null,"207","207","رشته: مهندسي صنايع- گرایش: سيستمهاي كلان - كارشناسي ارشد - دانشجویان ترم 02 - روزانه"]
[{"$f":"ROWS(A$2:C14)","v":13},"كارشناسي ارشد","مهندسي صنايع","سيستمهاي كلان","روزانه","مفاهیم و مدلهای تحلیل شبکه های اجتماعی","3",null,"کرمانی",3982,"ترم 02",3981,"پیشرفت اقتصادی",{"$f":"CONCATENATE('C'!O14,CHAR(10),'C'!P14)","v":"یکشنبه\nسه شنبه"},{"$f":"CONCATENATE('C'!Q14,CHAR(10),'C'!R14)","v":"15-17\n15-17"},"207\n207",null,"99/03/31","10",null,null,"15-17",null,"15-17",null,null,null,{"$f":"'C'!O14","v":"یکشنبه"},{"$f":"'C'!P14","v":"سه شنبه"},null,{"$f":"'C'!Q14","v":"15-17"},{"$f":"'C'!R14","v":"15-17"},null,"207","207","رشته: مهندسي صنايع- گرایش: سيستمهاي كلان - كارشناسي ارشد - دانشجویان ترم 02 - روزانه"]
[{"$f":"ROWS(A$2:C15)","v":14},"كارشناسي ارشد","مهندسي صنايع","سيستمهاي كلان","روزانه","پایان نامه",3,null,null,3982,"ترم 04 و بیشتر","3971 و قبل تر","پیشرفت اقتصادی",{"$f":"CONCATENATE('C'!O15,CHAR(10),'C'!P15)","v":"\n"},{"$f":"CONCATENATE('C'!Q15,CHAR(10),'C'!R15)","v":"\n"},"\n-",null,null,null,null,null,null,null,null,null,null,null,{"$f":"'C'!O15","v":""},{"$f":"'C'!P15","v":""},null,{"$f":"'C'!Q15","v":""},{"$f":"'C'!R15","v":""},null,"","-","رشته: مهندسي صنايع- گرایش: سيستمهاي كلان - كارشناسي ارشد - دانشجویان ترم 04 و بیشتر - روزانه"]
[{"$f":"ROWS(A$2:C16)","v":15},"دكتري تخصصي","سياست گذاري علم و فناوري","-","روزانه و پردیس","انتقال علم و فناوري",{"$f":"VLOOKUP(F16,[2]Sheet1!$M:$N,2,FALSE)","v":2},null,"منطقی",3982,"ترم 02",3981,"مدیریت و فلسفه علم و فناوری",{"$f":"CONCATENATE('C'!O16,CHAR(10),'C'!P16)","v":"چهارشنبه\n"},{"$f":"CONCATENATE('C'!Q16,CHAR(10),'C'!R16)","v":"10-12\n"},"207\n-",null,"99/03/25",8,null,null,null,null,null,"10-12",null,null,{"$f":"'C'!O16","v":"چهارشنبه"},{"$f":"'C'!P16","v":""},null,{"$f":"'C'!Q16","v":"10-12"},{"$f":"'C'!R16","v":""},null,"207","-","رشته: سياست گذاري علم و فناوري- گرایش: - - دكتري تخصصي - دانشجویان ترم 02 - روزانه و پردیس"]
[{"$f":"ROWS(A$2:C17)","v":16},"دكتري تخصصي","سياست گذاري علم و فناوري","-","روزانه و پردیس","علم ، فناوري و جامعه",{"$f":"VLOOKUP(F17,[2]Sheet1!$M:$N,2,FALSE)","v":2},null,"رفیعی",3982,"ترم 02",3981,"مدیریت و فلسفه علم و فناوری",{"$f":"CONCATENATE('C'!O17,CHAR(10),'C'!P17)","v":"چهارشنبه\n"},{"$f":"CONCATENATE('C'!Q17,CHAR(10),'C'!R17)","v":"8-10\n"},"207\n-",null,"99/03/27","8",null,null,null,null,null,"8-10",null,null,{"$f":"'C'!O17","v":"چهارشنبه"},{"$f":"'C'!P17","v":""},null,{"$f":"'C'!Q17","v":"8-10"},{"$f":"'C'!R17","v":""},null,"207","-","رشته: سياست گذاري علم و فناوري- گرایش: - - دكتري تخصصي - دانشجویان ترم 02 - روزانه و پردیس"]
[{"$f":"ROWS(A$2:C18)","v":17},"دكتري تخصصي","سياست گذاري علم و فناوري","-","روزانه و پردیس","مدلهاي سياستگذاري علم و فناوري",{"$f":"VLOOKUP(F18,[2]Sheet1!$M:$N,2,FALSE)","v":2},null,"سیف الدین",3982,"ترم 02",3981,"مدیریت و فلسفه علم و فناوری",{"$f":"CONCATENATE('C'!O18,CHAR(10),'C'!P18)","v":"چهارشنبه\n"},{"$f":"CONCATENATE('C'!Q18,CHAR(10),'C'!R18)","v":"15-17\n"},"207\n-",null,"99/04/01",14,null,null,null,null,null,"15-17",null,null,{"$f":"'C'!O18","v":"چهارشنبه"},{"$f":"'C'!P18","v":""},null,{"$f":"'C'!Q18","v":"15-17"},{"$f":"'C'!R18","v":""},null,"207","-","رشته: سياست گذاري علم و فناوري- گرایش: - - دكتري تخصصي - دانشجویان ترم 02 - روزانه و پردیس"]
[{"$f":"ROWS(A$2:C19)","v":18},"دكتري تخصصي","سياست گذاري علم و فناوري","-","روزانه و پردیس","مديريت دانش و فناوري اطلاعات",{"$f":"VLOOKUP(F19,[2]Sheet1!$M:$N,2,FALSE)","v":2},null,"ذاکری",3982,"ترم 02",3981,"مدیریت و فلسفه علم و فناوری",{"$f":"CONCATENATE('C'!O19,CHAR(10),'C'!P19)","v":"شنبه\n"},{"$f":"CONCATENATE('C'!Q19,CHAR(10),'C'!R19)","v":"13-15\n"},"209\n-",null,"99/04/03",8,null,"13-15",null,null,null,null,null,null,{"$f":"'C'!O19","v":"شنبه"},{"$f":"'C'!P19","v":""},null,{"$f":"'C'!Q19","v":"13-15"},{"$f":"'C'!R19","v":""},null,"209","-","رشته: سياست گذاري علم و فناوري- گرایش: - - دكتري تخصصي - دانشجویان ترم 02 - روزانه و پردیس"]
[{"$f":"ROWS(A$2:C20)","v":19},"دكتري تخصصي","سياست گذاري علم و فناوري","-","روزانه و پردیس","ارزیابی سرمایه گذاری و مدیریت ریسک فناوری",2,null,"شوال پور",3982,"ترم 02",3981,"مدیریت و فلسفه علم و فناوری",{"$f":"CONCATENATE('C'!O20,CHAR(10),'C'!P20)","v":"چهارشنبه\n"},{"$f":"CONCATENATE('C'!Q20,CHAR(10),'C'!R20)","v":"13-15\n"},"207\n-",null,"99/03/31","8",null,null,null,null,null,"13-15",null,null,{"$f":"'C'!O20","v":"چهارشنبه"},{"$f":"'C'!P20","v":""},null,{"$f":"'C'!Q20","v":"13-15"},{"$f":"'C'!R20","v":""},null,"207","-","رشته: سياست گذاري علم و فناوري- گرایش: - - دكتري تخصصي - دانشجویان ترم 02 - روزانه و پردیس"]
[{"$f":"ROWS(A$2:C21)","v":20},"دكتري تخصصي","سياست گذاري علم و فناوري","-","روزانه و پردیس","مطالاعات گروهی",0,null,"رفیعی",3982,"ترم 02",3981,"مدیریت و فلسفه علم و فناوری",{"$f":"CONCATENATE('C'!O21,CHAR(10),'C'!P21)","v":"شنبه\n"},{"$f":"CONCATENATE('C'!Q21,CHAR(10),'C'!R21)","v":"15-17\n"},"آزم\n-",null,"ندارد","ندارد",null,"15-17",null,null,null,null,null,null,{"$f":"'C'!O21","v":"شنبه"},{"$f":"'C'!P21","v":""},null,{"$f":"'C'!Q21","v":"15-17"},{"$f":"'C'!R21","v":""},null,"آزم","-","رشته: سياست گذاري علم و فناوري- گرایش: - - دكتري تخصصي - دانشجویان ترم 02 - روزانه و پردیس"]
[{"$f":"ROWS(A$2:C22)","v":21},"كارشناسي ارشد","كارآفريني","كسب و كار جديد","روزانه","الگوهاي تصميم گيري كارآفرينان",{"$f":"VLOOKUP(F22,[2]Sheet1!$M:$N,2,FALSE)","v":2},null,"پارسانژاد",3982,"ترم 02",3981,"مدیریت و فلسفه علم و فناوری",{"$f":"CONCATENATE('C'!O22,CHAR(10),'C'!P22)","v":"چهارشنبه\n"},{"$f":"CONCATENATE('C'!Q22,CHAR(10),'C'!R22)","v":"10-12\n"},"208\n-",null,"99/03/26","10",null,null,null,null,null,"10-12",null,null,{"$f":"'C'!O22","v":"چهارشنبه"},{"$f":"'C'!P22","v":""},null,{"$f":"'C'!Q22","v":"10-12"},{"$f":"'C'!R22","v":""},null,"208","-","رشته: كارآفريني- گرایش: كسب و كار جديد - كارشناسي ارشد - دانشجویان ترم 02 - روزانه"]
[{"$f":"ROWS(A$2:C23)","v":22},"كارشناسي ارشد","كارآفريني","كسب و كار جديد","روزانه","بازاريابي خدمات",{"$f":"VLOOKUP(F23,[2]Sheet1!$M:$N,2,FALSE)","v":2},null,"حمیدی زاده",3982,"ترم 02",3981,"مدیریت و فلسفه علم و فناوری",{"$f":"CONCATENATE('C'!O23,CHAR(10),'C'!P23)","v":"یکشنبه\n"},{"$f":"CONCATENATE('C'!Q23,CHAR(10),'C'!R23)","v":"13-15\n"},"208\n-",null,"99/04/02","10",null,null,"13-15",null,null,null,null,null,{"$f":"'C'!O23","v":"یکشنبه"},{"$f":"'C'!P23","v":""},null,{"$f":"'C'!Q23","v":"13-15"},{"$f":"'C'!R23","v":""},null,"208","-","رشته: كارآفريني- گرایش: كسب و كار جديد - كارشناسي ارشد - دانشجویان ترم 02 - روزانه"]
[{"$f":"ROWS(A$2:C24)","v":23},"كارشناسي ارشد","كارآفريني","كسب و كار جديد","روزانه","تشخيص فرصت هاي كارآفريني",{"$f":"VLOOKUP(F24,[2]Sheet1!$M:$N,2,FALSE)","v":2},null,"صالحی",3982,"ترم 02",3981,"مدیریت و فلسفه علم و فناوری",{"$f":"CONCATENATE('C'!O24,CHAR(10),'C'!P24)","v":"یکشنبه\n"},{"$f":"CONCATENATE('C'!Q24,CHAR(10),'C'!R24)","v":"8-10\n"},"208\n-",null,"99/03/27","8",null,null,"8-10",null,null,null,null,null,{"$f":"'C'!O24","v":"یکشنبه"},{"$f":"'C'!P24","v":""},null,{"$f":"'C'!Q24","v":"8-10"},{"$f":"'C'!R24","v":""},null,"208","-","رشته: كارآفريني- گرایش: كسب و كار جديد - كارشناسي ارشد - دانشجویان ترم 02 - روزانه"]
[{"$f":"ROWS(A$2:C25)","v":24},"كارشناسي ارشد","كارآفريني","كسب و كار جديد","روزانه","تئوريهاي مديريت پيشرفته",{"$f":"VLOOKUP(F25,[2]Sheet1!$M:$N,2,FALSE)","v":2},null,"عبدالحمید",3982,"ترم 02",3981,"مدیریت و فلسفه علم و فناوری",{"$f":"CONCATENATE('C'!O25,CHAR(10),'C'!P25)","v":"یکشنبه\n"},{"$f":"CONCATENATE('C'!Q25,CHAR(10),'C'!R25)","v":"10-12\n"},"208\n-",null,"99/04/05","14",null,null,"10-12",null,null,null,null,null,{"$f":"'C'!O25","v":"یکشنبه"},{"$f":"'C'!P25","v":""},null,{"$f":"'C'!Q25","v":"10-12"},{"$f":"'C'!R25","v":""},null,"208","-","رشته: كارآفريني- گرایش: كسب و كار جديد - كارشناسي ارشد - دانشجویان ترم 02 - روزانه"]
[{"$f":"ROWS(A$2:C26)","v":25},"كارشناسي ارشد","كارآفريني","كسب و كار جديد","روزانه","كارآفريني در بستر فناوري اطلاعات",{"$f":"VLOOKUP(F26,[2]Sheet1!$M:$N,2,FALSE)","v":2},null,"خانی زاد",3982,"ترم 02",3981,"مدیریت و فلسفه علم و فناوری",{"$f":"CONCATENATE('C'!O26,CHAR(10),'C'!P26)","v":"چهارشنبه\n"},{"$f":"CONCATENATE('C'!Q26,CHAR(10),'C'!R26)","v":"8-10\n"},"208\n-",null,"99/04/01","14",null,null,null,null,null,"8-10",null,null,{"$f":"'C'!O26","v":"چهارشنبه"},{"$f":"'C'!P26","v":""},null,{"$f":"'C'!Q26","v":"8-10"},{"$f":"'C'!R26","v":""},null,"208","-","رشته: كارآفريني- گرایش: كسب و كار جديد - كارشناسي ارشد - دانشجویان ترم 02 - روزانه"]
[{"$f":"ROWS(A$2:C27)","v":26},"كارشناسي ارشد","كارآفريني","كسب و كار جديد","روزانه","مديريت زنجيره تامين",{"$f":"VLOOKUP(F27,[2]Sheet1!$M:$N,2,FALSE)","v":2},null,"تیموری",3982,"ترم 02",3981,"مدیریت و فلسفه علم و فناوری",{"$f":"CONCATENATE('C'!O27,CHAR(10),'C'!P27)","v":"یکشنبه\n"},{"$f":"CONCATENATE('C'!Q27,CHAR(10),'C'!R27)","v":"15-17\n"},"208\n-",null,"99/04/03","14",null,null,"15-17",null,null,null,null,null,{"$f":"'C'!O27","v":"یکشنبه"},{"$f":"'C'!P27","v":""},null,{"$f":"'C'!Q27","v":"15-17"},{"$f":"'C'!R27","v":""},null,"208","-","رشته: كارآفريني- گرایش: كسب و كار جديد - كارشناسي ارشد - دانشجویان ترم 02 - روزانه"]
[{"$f":"ROWS(A$2:C28)","v":27},"كارشناسي ارشد","كارآفريني","كسب و كار جديد","روزانه","مباحث منتخب",{"$f":"VLOOKUP(F28,[2]Sheet1!$M:$N,2,FALSE)","v":2},null,"پارسانژاد","3982","ترم 04","3971","مدیریت و فلسفه علم و فناوری",{"$f":"CONCATENATE('C'!O28,CHAR(10),'C'!P28)","v":"سه شنبه\n"},{"$f":"CONCATENATE('C'!Q28,CHAR(10),'C'!R28)","v":"10-12\n"},"213\n-",null,"99/04/04","8",null,null,null,null,"10-12",null,null,null,{"$f":"'C'!O28","v":"سه شنبه"},{"$f":"'C'!P28","v":""},null,{"$f":"'C'!Q28","v":"10-12"},{"$f":"'C'!R28","v":""},null,"213","-","رشته: كارآفريني- گرایش: كسب و كار جديد - كارشناسي ارشد - دانشجویان ترم 04 - روزانه"]
[{"$f":"ROWS(A$2:C29)","v":28},"كارشناسي ارشد","كارآفريني","كسب و كار جديد","روزانه","پایان نامه",4,null,null,3982,"ترم 04 و بیشتر","3971 و قبل تر","مدیریت و فلسفه علم و فناوری",{"$f":"CONCATENATE('C'!O29,CHAR(10),'C'!P29)","v":"\n"},{"$f":"CONCATENATE('C'!Q29,CHAR(10),'C'!R29)","v":"\n"},"\n-",null,null,null,null,null,null,null,null,null,null,null,{"$f":"'C'!O29","v":""},{"$f":"'C'!P29","v":""},null,{"$f":"'C'!Q29","v":""},{"$f":"'C'!R29","v":""},null,"","-","رشته: كارآفريني- گرایش: كسب و كار جديد - كارشناسي ارشد - دانشجویان ترم 04 و بیشتر - روزانه"]
[{"$f":"ROWS(A$2:C30)","v":29},"كارشناسي ارشد","مديريت فناوري اطلاعات","كسب و كار الكترونيك","پردیس","سيستمهاي يكپارچه كسب و كار الكترونيك",{"$f":"VLOOKUP(F30,[2]Sheet1!$M:$N,2,FALSE)","v":2},null,"وحیدی",3982,"ترم 02",3981,"مدیریت و فلسفه علم و فناوری",{"$f":"CONCATENATE('C'!O30,CHAR(10),'C'!P30)","v":"پنج شنبه\n"},{"$f":"CONCATENATE('C'!Q30,CHAR(10),'C'!R30)","v":"8-10\n"},"207\n-",null,"99/04/02",14,null,null,null,null,null,null,"8-10",null,{"$f":"'C'!O30","v":"پنج شنبه"},{"$f":"'C'!P30","v":""},null,{"$f":"'C'!Q30","v":"8-10"},{"$f":"'C'!R30","v":""},null,"207","-","رشته: مديريت فناوري اطلاعات- گرایش: كسب و كار الكترونيك - كارشناسي ارشد - دانشجویان ترم 02 - پردیس"]
[{"$f":"ROWS(A$2:C31)","v":30},"كارشناسي ارشد","مديريت فناوري اطلاعات","كسب و كار الكترونيك","روزانه","سيستمهاي يكپارچه كسب و كار الكترونيك",{"$f":"VLOOKUP(F31,[2]Sheet1!$M:$N,2,FALSE)","v":2},null,"وحیدی",3982,"ترم 02",3981,"مدیریت و فلسفه علم و فناوری",{"$f":"CONCATENATE('C'!O31,CHAR(10),'C'!P31)","v":"چهارشنبه\n"},{"$f":"CONCATENATE('C'!Q31,CHAR(10),'C'!R31)","v":"15-17\n"},"208\n-",null,"99/04/02",14,null,null,null,null,null,"15-17",null,null,{"$f":"'C'!O31","v":"چهارشنبه"},{"$f":"'C'!P31","v":""},null,{"$f":"'C'!Q31","v":"15-17"},{"$f":"'C'!R31","v":""},null,"208","-","رشته: مديريت فناوري اطلاعات- گرایش: كسب و كار الكترونيك - كارشناسي ارشد - دانشجویان ترم 02 - روزانه"]
[{"$f":"ROWS(A$2:C32)","v":31},"كارشناسي ارشد","مديريت فناوري اطلاعات","كسب و كار الكترونيك","پردیس","مباني تئوري و فلسفي سيستمهاي اطلاعاتي",{"$f":"VLOOKUP(F32,[2]Sheet1!$M:$N,2,FALSE)","v":2},null,"رفیعی آتانی",3982,"ترم 02",3981,"مدیریت و فلسفه علم و فناوری",{"$f":"CONCATENATE('C'!O32,CHAR(10),'C'!P32)","v":"چهارشنبه\n"},{"$f":"CONCATENATE('C'!Q32,CHAR(10),'C'!R32)","v":"13-15\n"},"208\n-",null,"99/04/04","8",null,null,null,null,null,"13-15",null,null,{"$f":"'C'!O32","v":"چهارشنبه"},{"$f":"'C'!P32","v":""},null,{"$f":"'C'!Q32","v":"13-15"},{"$f":"'C'!R32","v":""},null,"208","-","رشته: مديريت فناوري اطلاعات- گرایش: كسب و كار الكترونيك - كارشناسي ارشد - دانشجویان ترم 02 - پردیس"]
[{"$f":"ROWS(A$2:C33)","v":32},"كارشناسي ارشد","مديريت فناوري اطلاعات","كسب و كار الكترونيك","روزانه","مباني تئوري و فلسفي سيستمهاي اطلاعاتي",{"$f":"VLOOKUP(F33,[2]Sheet1!$M:$N,2,FALSE)","v":2},null,"رفیعی آتانی",3982,"ترم 02",3981,"مدیریت و فلسفه علم و فناوری",{"$f":"CONCATENATE('C'!O33,CHAR(10),'C'!P33)","v":"دوشنبه\n"},{"$f":"CONCATENATE('C'!Q33,CHAR(10),'C'!R33)","v":"10-12\n"},"207\n-",null,"99/04/04","8",null,null,null,"10-12",null,null,null,null,{"$f":"'C'!O33","v":"دوشنبه"},{"$f":"'C'!P33","v":""},null,{"$f":"'C'!Q33","v":"10-12"},{"$f":"'C'!R33","v":""},null,"207","-","رشته: مديريت فناوري اطلاعات- گرایش: كسب و كار الكترونيك - كارشناسي ارشد - دانشجویان ترم 02 - روزانه"]
[{"$f":"ROWS(A$2:C34)","v":33},"كارشناسي ارشد","مديريت فناوري اطلاعات","كسب و كار الكترونيك","پردیس","مدلهاي كسب و كار الكترونيك",{"$f":"VLOOKUP(F34,[2]Sheet1!$M:$N,2,FALSE)","v":2},null,"صالحی",3982,"ترم 02",3981,"مدیریت و فلسفه علم و فناوری",{"$f":"CONCATENATE('C'!O34,CHAR(10),'C'!P34)","v":"چهارشنبه\n"},{"$f":"CONCATENATE('C'!Q34,CHAR(10),'C'!R34)","v":"10-12\n"},"209\n-",null,"99/03/31",14,null,null,null,null,null,"10-12",null,null,{"$f":"'C'!O34","v":"چهارشنبه"},{"$f":"'C'!P34","v":""},null,{"$f":"'C'!Q34","v":"10-12"},{"$f":"'C'!R34","v":""},null,"209","-","رشته: مديريت فناوري اطلاعات- گرایش: كسب و كار الكترونيك - كارشناسي ارشد - دانشجویان ترم 02 - پردیس"]
[{"$f":"ROWS(A$2:C35)","v":34},"كارشناسي ارشد","مديريت فناوري اطلاعات","كسب و كار الكترونيك","روزانه","مدلهاي كسب و كار الكترونيك",{"$f":"VLOOKUP(F35,[2]Sheet1!$M:$N,2,FALSE)","v":2},null,"صالحی",3982,"ترم 02",3981,"مدیریت و فلسفه علم و فناوری",{"$f":"CONCATENATE('C'!O35,CHAR(10),'C'!P35)","v":"دوشنبه\n"},{"$f":"CONCATENATE('C'!Q35,CHAR(10),'C'!R35)","v":"8-10\n"},"207\n-",null,"99/03/31","8",null,null,null,"8-10",null,null,null,null,{"$f":"'C'!O35","v":"دوشنبه"},{"$f":"'C'!P35","v":""},null,{"$f":"'C'!Q35","v":"8-10"},{"$f":"'C'!R35","v":""},null,"207","-","رشته: مديريت فناوري اطلاعات- گرایش: كسب و كار الكترونيك - كارشناسي ارشد - دانشجویان ترم 02 - روزانه"]
[{"$f":"ROWS(A$2:C36)","v":35},"كارشناسي ارشد","مديريت فناوري اطلاعات","كسب و كار الكترونيك","پردیس","مديريت استراتژيك سيستمهاي اطلاعاتي",{"$f":"VLOOKUP(F36,[2]Sheet1!$M:$N,2,FALSE)","v":2},null,"ذاکری",3982,"ترم 02",3981,"مدیریت و فلسفه علم و فناوری",{"$f":"CONCATENATE('C'!O36,CHAR(10),'C'!P36)","v":"چهارشنبه\n"},{"$f":"CONCATENATE('C'!Q36,CHAR(10),'C'!R36)","v":"15-17\n"},"209\n-",null,"99/03/27",14,null,null,null,null,null,"15-17",null,null,{"$f":"'C'!O36","v":"چهارشنبه"},{"$f":"'C'!P36","v":""},null,{"$f":"'C'!Q36","v":"15-17"},{"$f":"'C'!R36","v":""},null,"209","-","رشته: مديريت فناوري اطلاعات- گرایش: كسب و كار الكترونيك - كارشناسي ارشد - دانشجویان ترم 02 - پردیس"]
[{"$f":"ROWS(A$2:C37)","v":36},"كارشناسي ارشد","مديريت فناوري اطلاعات","كسب و كار الكترونيك","روزانه","مديريت استراتژيك سيستمهاي اطلاعاتي",{"$f":"VLOOKUP(F37,[2]Sheet1!$M:$N,2,FALSE)","v":2},null,"ذاکری",3982,"ترم 02",3981,"مدیریت و فلسفه علم و فناوری",{"$f":"CONCATENATE('C'!O37,CHAR(10),'C'!P37)","v":"چهارشنبه\n"},{"$f":"CONCATENATE('C'!Q37,CHAR(10),'C'!R37)","v":"8-10\n"},"209\n-",null,"99/03/27",14,null,null,null,null,null,"8-10",null,null,{"$f":"'C'!O37","v":"چهارشنبه"},{"$f":"'C'!P37","v":""},null,{"$f":"'C'!Q37","v":"8-10"},{"$f":"'C'!R37","v":""},null,"209","-","رشته: مديريت فناوري اطلاعات- گرایش: كسب و كار الكترونيك - كارشناسي ارشد - دانشجویان ترم 02 - روزانه"]
[{"$f":"ROWS(A$2:C38)","v":37},"كارشناسي ارشد","مديريت فناوري اطلاعات","كسب و كار الكترونيك","پردیس","مديريت امنيت فناوري اطلاعات",{"$f":"VLOOKUP(F38,[2]Sheet1!$M:$N,2,FALSE)","v":2},null,"خانی زاد",3982,"ترم 02",3981,"مدیریت و فلسفه علم و فناوری",{"$f":"CONCATENATE('C'!O38,CHAR(10),'C'!P38)","v":"پنج شنبه\n"},{"$f":"CONCATENATE('C'!Q38,CHAR(10),'C'!R38)","v":"10-12\n"},"207\n-",null,"99/03/24",10,null,null,null,null,null,null,"10-12",null,{"$f":"'C'!O38","v":"پنج شنبه"},{"$f":"'C'!P38","v":""},null,{"$f":"'C'!Q38","v":"10-12"},{"$f":"'C'!R38","v":""},null,"207","-","رشته: مديريت فناوري اطلاعات- گرایش: كسب و كار الكترونيك - كارشناسي ارشد - دانشجویان ترم 02 - پردیس"]
[{"$f":"ROWS(A$2:C39)","v":38},"كارشناسي ارشد","مديريت فناوري اطلاعات","كسب و كار الكترونيك","روزانه","مديريت امنيت فناوري اطلاعات",{"$f":"VLOOKUP(F39,[2]Sheet1!$M:$N,2,FALSE)","v":2},null,"خانی زاد",3982,"ترم 02",3981,"مدیریت و فلسفه علم و فناوری",{"$f":"CONCATENATE('C'!O39,CHAR(10),'C'!P39)","v":"دوشنبه\n"},{"$f":"CONCATENATE('C'!Q39,CHAR(10),'C'!R39)","v":"15-17\n"},"207\n-",null,"99/03/24",10,null,null,null,"15-17",null,null,null,null,{"$f":"'C'!O39","v":"دوشنبه"},{"$f":"'C'!P39","v":""},null,{"$f":"'C'!Q39","v":"15-17"},{"$f":"'C'!R39","v":""},null,"207","-","رشته: مديريت فناوري اطلاعات- گرایش: كسب و كار الكترونيك - كارشناسي ارشد - دانشجویان ترم 02 - روزانه"]
[{"$f":"ROWS(A$2:C40)","v":39},"كارشناسي ارشد","مديريت فناوري اطلاعات","كسب و كار الكترونيك","پردیس","پایان نامه",4,null,null,3982,"ترم 04 و بیشتر","3971 و قبل تر","مدیریت و فلسفه علم و فناوری",{"$f":"CONCATENATE('C'!O40,CHAR(10),'C'!P40)","v":"\n"},{"$f":"CONCATENATE('C'!Q40,CHAR(10),'C'!R40)","v":"\n"},"\n-",null,null,null,null,null,null,null,null,null,null,null,{"$f":"'C'!O40","v":""},{"$f":"'C'!P40","v":""},null,{"$f":"'C'!Q40","v":""},{"$f":"'C'!R40","v":""},null,"","-","رشته: مديريت فناوري اطلاعات- گرایش: كسب و كار الكترونيك - كارشناسي ارشد - دانشجویان ترم 04 و بیشتر - پردیس"]
[{"$f":"ROWS(A$2:C41)","v":40},"كارشناسي ارشد","مديريت فناوري اطلاعات","كسب و كار الكترونيك","روزانه","پایان نامه",4,null,null,3982,"ترم 04 و بیشتر","3971 و قبل تر","مدیریت و فلسفه علم و فناوری",{"$f":"CONCATENATE('C'!O41,CHAR(10),'C'!P41)","v":"\n"},{"$f":"CONCATENATE('C'!Q41,CHAR(10),'C'!R41)","v":"\n"},"\n-",null,null,null,null,null,null,null,null,null,null,null,{"$f":"'C'!O41","v":""},{"$f":"'C'!P41","v":""},null,{"$f":"'C'!Q41","v":""},{"$f":"'C'!R41","v":""},null,"","-","رشته: مديريت فناوري اطلاعات- گرایش: كسب و كار الكترونيك - كارشناسي ارشد - دانشجویان ترم 04 و بیشتر - روزانه"]
[{"$f":"ROWS(A$2:C42)","v":41},"كارشناسي ارشد","مديريت تكنولوژي","نوآوري تكنولوژي - سياست هاي تحقيق و توسعه","روزانه","ارزيابي تكنولوژي",{"$f":"VLOOKUP(F42,[2]Sheet1!$M:$N,2,FALSE)","v":2},null,"شوال پور",3982,"ترم 02",3981,"مدیریت و مهندسی کسب و کار",{"$f":"CONCATENATE('C'!O42,CHAR(10),'C'!P42)","v":"شنبه\n"},{"$f":"CONCATENATE('C'!Q42,CHAR(10),'C'!R42)","v":"15-17\n"},"210\n-",null,"99/03/25",14,null,"15-17",null,null,null,null,null,null,{"$f":"'C'!O42","v":"شنبه"},{"$f":"'C'!P42","v":""},null,{"$f":"'C'!Q42","v":"15-17"},{"$f":"'C'!R42","v":""},null,"210","-","رشته: مديريت تكنولوژي- گرایش: نوآوري تكنولوژي - سياست هاي تحقيق و توسعه - كارشناسي ارشد - دانشجویان ترم 02 - روزانه"]
[{"$f":"ROWS(A$2:C43)","v":42},"كارشناسي ارشد","مديريت تكنولوژي","نوآوري تكنولوژي - سياست هاي تحقيق و توسعه","روزانه","پروژه ترم",{"$f":"VLOOKUP(F43,[2]Sheet1!$M:$N,2,FALSE)","v":2},null,"عبدالحمید",3982,"ترم 02",3981,"مدیریت و مهندسی کسب و کار",{"$f":"CONCATENATE('C'!O43,CHAR(10),'C'!P43)","v":"شنبه\n"},{"$f":"CONCATENATE('C'!Q43,CHAR(10),'C'!R43)","v":"13-15\n"},"210\n-",null,"99/03/29","8",null,"13-15",null,null,null,null,null,null,{"$f":"'C'!O43","v":"شنبه"},{"$f":"'C'!P43","v":""},null,{"$f":"'C'!Q43","v":"13-15"},{"$f":"'C'!R43","v":""},null,"210","-","رشته: مديريت تكنولوژي- گرایش: نوآوري تكنولوژي - سياست هاي تحقيق و توسعه - كارشناسي ارشد - دانشجویان ترم 02 - روزانه"]
[{"$f":"ROWS(A$2:C44)","v":43},"كارشناسي ارشد","مديريت تكنولوژي","نوآوري تكنولوژي - سياست هاي تحقيق و توسعه","روزانه","پيش بيني تكنولوژي",{"$f":"VLOOKUP(F44,[2]Sheet1!$M:$N,2,FALSE)","v":2},null,"شفیعا",3982,"ترم 02",3981,"مدیریت و مهندسی کسب و کار",{"$f":"CONCATENATE('C'!O44,CHAR(10),'C'!P44)","v":"شنبه\n"},{"$f":"CONCATENATE('C'!Q44,CHAR(10),'C'!R44)","v":"10-12\n"},"سای\n-",null,"99/04/03","10",null,"10-12",null,null,null,null,null,null,{"$f":"'C'!O44","v":"شنبه"},{"$f":"'C'!P44","v":""},null,{"$f":"'C'!Q44","v":"10-12"},{"$f":"'C'!R44","v":""},null,"سای","-","رشته: مديريت تكنولوژي- گرایش: نوآوري تكنولوژي - سياست هاي تحقيق و توسعه - كارشناسي ارشد - دانشجویان ترم 02 - روزانه"]
[{"$f":"ROWS(A$2:C45)","v":44},"كارشناسي ارشد","مديريت تكنولوژي","نوآوري تكنولوژي - سياست هاي تحقيق و توسعه","روزانه","نظام ملی نوآوری","2",null,"صالحی",3982,"ترم 02",3981,"مدیریت و مهندسی کسب و کار",{"$f":"CONCATENATE('C'!O45,CHAR(10),'C'!P45)","v":"چهارشنبه\n"},{"$f":"CONCATENATE('C'!Q45,CHAR(10),'C'!R45)","v":"8-10\n"},"210\n-",null,"99/03/27","8",null,null,null,null,null,"8-10",null,null,{"$f":"'C'!O45","v":"چهارشنبه"},{"$f":"'C'!P45","v":""},null,{"$f":"'C'!Q45","v":"8-10"},{"$f":"'C'!R45","v":""},null,"210","-","رشته: مديريت تكنولوژي- گرایش: نوآوري تكنولوژي - سياست هاي تحقيق و توسعه - كارشناسي ارشد - دانشجویان ترم 02 - روزانه"]
[{"$f":"ROWS(A$2:C46)","v":45},"كارشناسي ارشد","مديريت تكنولوژي","نوآوري تكنولوژي - سياست هاي تحقيق و توسعه","روزانه","مديريت رفتار سازماني پيشرفته",{"$f":"VLOOKUP(F46,[2]Sheet1!$M:$N,2,FALSE)","v":2},null,"بنیادی",3982,"ترم 02",3981,"مدیریت و مهندسی کسب و کار",{"$f":"CONCATENATE('C'!O46,CHAR(10),'C'!P46)","v":"چهارشنبه\n"},{"$f":"CONCATENATE('C'!Q46,CHAR(10),'C'!R46)","v":"10-12\n"},"210\n-",null,"99/04/05",10,null,null,null,null,null,"10-12",null,null,{"$f":"'C'!O46","v":"چهارشنبه"},{"$f":"'C'!P46","v":""},null,{"$f":"'C'!Q46","v":"10-12"},{"$f":"'C'!R46","v":""},null,"210","-","رشته: مديريت تكنولوژي- گرایش: نوآوري تكنولوژي - سياست هاي تحقيق و توسعه - كارشناسي ارشد - دانشجویان ترم 02 - روزانه"]
[{"$f":"ROWS(A$2:C47)","v":46},"كارشناسي ارشد","مديريت تكنولوژي","نوآوري تكنولوژي - سياست هاي تحقيق و توسعه","روزانه","پايان نامه",{"$f":"VLOOKUP(F47,[2]Sheet1!$M:$N,2,FALSE)","v":0},null,null,3982,"ترم 04 و بیشتر","3971 و قبل تر","مدیریت و مهندسی کسب و کار",{"$f":"CONCATENATE('C'!O47,CHAR(10),'C'!P47)","v":"\n"},{"$f":"CONCATENATE('C'!Q47,CHAR(10),'C'!R47)","v":"\n"},"\n-",null,null,null,null,null,null,null,null,null,null,null,{"$f":"'C'!O47","v":""},{"$f":"'C'!P47","v":""},null,{"$f":"'C'!Q47","v":""},{"$f":"'C'!R47","v":""},null,"","-","رشته: مديريت تكنولوژي- گرایش: نوآوري تكنولوژي - سياست هاي تحقيق و توسعه - كارشناسي ارشد - دانشجویان ترم 04 و بیشتر - روزانه"]
[{"$f":"ROWS(A$2:C48)","v":47},"دكتري تخصصي","مديريت تكنولوژي","مديريت نوآوري","روزانه و پردیس","توانايي هاي نوآوري",{"$f":"VLOOKUP(F48,[2]Sheet1!$M:$N,2,FALSE)","v":3},null,"منطقی",3982,"ترم 02",3981,"مدیریت و مهندسی کسب و کار",{"$f":"CONCATENATE('C'!O48,CHAR(10),'C'!P48)","v":"چهارشنبه\n"},{"$f":"CONCATENATE('C'!Q48,CHAR(10),'C'!R48)","v":"8-10\n"},"213\n-",null,"99/03/25",8,null,null,null,null,null,"8-10",null,null,{"$f":"'C'!O48","v":"چهارشنبه"},{"$f":"'C'!P48","v":""},null,{"$f":"'C'!Q48","v":"8-10"},{"$f":"'C'!R48","v":""},null,"213","-","رشته: مديريت تكنولوژي- گرایش: مديريت نوآوري - دكتري تخصصي - دانشجویان ترم 02 - روزانه و پردیس"]
[{"$f":"ROWS(A$2:C49)","v":48},"دكتري تخصصي","مديريت تكنولوژي","مديريت نوآوري","روزانه و پردیس","فرايند نوآوري و تجربه كشورهاي پيشرفته",{"$f":"VLOOKUP(F49,[2]Sheet1!$M:$N,2,FALSE)","v":3},null,"بنیادی",3982,"ترم 02",3981,"مدیریت و مهندسی کسب و کار",{"$f":"CONCATENATE('C'!O49,CHAR(10),'C'!P49)","v":"چهارشنبه\n"},{"$f":"CONCATENATE('C'!Q49,CHAR(10),'C'!R49)","v":"13-15\n"},"209\n-",null,"99/04/04","8",null,null,null,null,null,"13-15",null,null,{"$f":"'C'!O49","v":"چهارشنبه"},{"$f":"'C'!P49","v":""},null,{"$f":"'C'!Q49","v":"13-15"},{"$f":"'C'!R49","v":""},null,"209","-","رشته: مديريت تكنولوژي- گرایش: مديريت نوآوري - دكتري تخصصي - دانشجویان ترم 02 - روزانه و پردیس"]
[{"$f":"ROWS(A$2:C50)","v":49},"دكتري تخصصي","مديريت تكنولوژي","مديريت نوآوري","روزانه و پردیس","مباني استراتژيهاي توسعه تكنولوژي",{"$f":"VLOOKUP(F50,[2]Sheet1!$M:$N,2,FALSE)","v":2},null,"شوال پور",3982,"ترم 02",3981,"مدیریت و مهندسی کسب و کار",{"$f":"CONCATENATE('C'!O50,CHAR(10),'C'!P50)","v":"شنبه\n"},{"$f":"CONCATENATE('C'!Q50,CHAR(10),'C'!R50)","v":"8-10\n"},"209\n-",null,"99/03/27","8",null,"8-10",null,null,null,null,null,null,{"$f":"'C'!O50","v":"شنبه"},{"$f":"'C'!P50","v":""},null,{"$f":"'C'!Q50","v":"8-10"},{"$f":"'C'!R50","v":""},null,"209","-","رشته: مديريت تكنولوژي- گرایش: مديريت نوآوري - دكتري تخصصي - دانشجویان ترم 02 - روزانه و پردیس"]
[{"$f":"ROWS(A$2:C51)","v":50},"دكتري تخصصي","مديريت تكنولوژي","مديريت نوآوري","روزانه و پردیس","مباني نظريه هاي اقتصاددانان كلاسيك و نئوكلاسيك و نظريه پردازان جديد در زمينه توسعه تكنولوژي و سير تح",{"$f":"VLOOKUP(F51,[2]Sheet1!$M:$N,2,FALSE)","v":2},null,"میرزامحمدی",3982,"ترم 02",3981,"مدیریت و مهندسی کسب و کار",{"$f":"CONCATENATE('C'!O51,CHAR(10),'C'!P51)","v":"چهارشنبه\n"},{"$f":"CONCATENATE('C'!Q51,CHAR(10),'C'!R51)","v":"10-12\n"},"213\n-",null,"99/04/02","8",null,null,null,null,null,"10-12",null,null,{"$f":"'C'!O51","v":"چهارشنبه"},{"$f":"'C'!P51","v":""},null,{"$f":"'C'!Q51","v":"10-12"},{"$f":"'C'!R51","v":""},null,"213","-","رشته: مديريت تكنولوژي- گرایش: مديريت نوآوري - دكتري تخصصي - دانشجویان ترم 02 - روزانه و پردیس"]
[{"$f":"ROWS(A$2:C52)","v":51},"دكتري تخصصي","مديريت تكنولوژي","مديريت نوآوري","روزانه و پردیس","مطالاعات گروهی",0,null,"رفیعی",3982,"ترم 02",3981,"مدیریت و مهندسی کسب و کار",{"$f":"CONCATENATE('C'!O52,CHAR(10),'C'!P52)","v":"شنبه\n"},{"$f":"CONCATENATE('C'!Q52,CHAR(10),'C'!R52)","v":"15-17\n"},"آزم\n-",null,"ندارد","ندارد",null,"15-17",null,null,null,null,null,null,{"$f":"'C'!O52","v":"شنبه"},{"$f":"'C'!P52","v":""},null,{"$f":"'C'!Q52","v":"15-17"},{"$f":"'C'!R52","v":""},null,"آزم","-","رشته: مديريت تكنولوژي- گرایش: مديريت نوآوري - دكتري تخصصي - دانشجویان ترم 02 - روزانه و پردیس"]
[{"$f":"ROWS(A$2:C53)","v":52},"دكتري تخصصي","مديريت سازمان هاي دولتي ايران","سياستگذاري دولتي(خط مشي گذاري عمومي)","روزانه و پردیس","اجرا و ارزيابي خط مشي هاي عمومي در ايران",{"$f":"VLOOKUP(F53,[2]Sheet1!$M:$N,2,FALSE)","v":2},null,"عبدالحمید",3982,"ترم 02",3981,"مدیریت و مهندسی کسب و کار","دوشنبه\n",{"$f":"CONCATENATE('C'!Q53,CHAR(10),'C'!R53)","v":"8-10\n"},"209\n-",null,"99/04/05","14",null,"8-10",null,null,null,null,null,null,{"$f":"'C'!O53","v":"شنبه"},{"$f":"'C'!P53","v":""},null,{"$f":"'C'!Q53","v":"8-10"},{"$f":"'C'!R53","v":""},null,"209","-","رشته: مديريت سازمان هاي دولتي ايران- گرایش: سياستگذاري دولتي(خط مشي گذاري عمومي) - دكتري تخصصي - دانشجویان ترم 02 - روزانه و پردیس"]
[{"$f":"ROWS(A$2:C54)","v":53},"دكتري تخصصي","مديريت سازمان هاي دولتي ايران","سياستگذاري دولتي(خط مشي گذاري عمومي)","روزانه و پردیس","مبانی پژوهشی قرآن و مفاهیم مدیریتی در قرآن (تفسیر)",2,null,"معینی",3982,"ترم 02",3981,"مدیریت و مهندسی کسب و کار",{"$f":"CONCATENATE('C'!O54,CHAR(10),'C'!P54)","v":"شنبه\n"},{"$f":"CONCATENATE('C'!Q54,CHAR(10),'C'!R54)","v":"10-12\n"},"209\n-",null,"99/03/27","8",null,"10-12",null,null,null,null,null,null,{"$f":"'C'!O54","v":"شنبه"},{"$f":"'C'!P54","v":""},null,{"$f":"'C'!Q54","v":"10-12"},{"$f":"'C'!R54","v":""},null,"209","-","رشته: مديريت سازمان هاي دولتي ايران- گرایش: سياستگذاري دولتي(خط مشي گذاري عمومي) - دكتري تخصصي - دانشجویان ترم 02 - روزانه و پردیس"]
[{"$f":"ROWS(A$2:C55)","v":54},"دكتري تخصصي","مديريت سازمان هاي دولتي ايران","سياستگذاري دولتي(خط مشي گذاري عمومي)","روزانه و پردیس","مبانی فلسفی اداره امور عمومی از دیدگاه اسلام",2,null,"رفیعی",3982,"ترم 02",3981,"مدیریت و مهندسی کسب و کار",{"$f":"CONCATENATE('C'!O55,CHAR(10),'C'!P55)","v":"شنبه\n"},{"$f":"CONCATENATE('C'!Q55,CHAR(10),'C'!R55)","v":"13-15\n"},"213\n-",null,"99/03/25","8",null,"13-15",null,null,null,null,null,null,{"$f":"'C'!O55","v":"شنبه"},{"$f":"'C'!P55","v":""},null,{"$f":"'C'!Q55","v":"13-15"},{"$f":"'C'!R55","v":""},null,"213","-","رشته: مديريت سازمان هاي دولتي ايران- گرایش: سياستگذاري دولتي(خط مشي گذاري عمومي) - دكتري تخصصي - دانشجویان ترم 02 - روزانه و پردیس"]
[{"$f":"ROWS(A$2:C56)","v":55},"دكتري تخصصي","مديريت سازمان هاي دولتي ايران","سياستگذاري دولتي(خط مشي گذاري عمومي)","روزانه و پردیس","حقوق اداری و سازمان نظام ج ا ا",null,null,"موسی زاده",3982,"ترم 02",3981,"مدیریت و مهندسی کسب و کار",{"$f":"CONCATENATE('C'!O56,CHAR(10),'C'!P56)","v":"شنبه\n"},{"$f":"CONCATENATE('C'!Q56,CHAR(10),'C'!R56)","v":"8-10\n"},"210\n-",null,"99/04/02","8",null,"8-10",null,null,null,null,null,null,{"$f":"'C'!O56","v":"شنبه"},{"$f":"'C'!P56","v":""},null,{"$f":"'C'!Q56","v":"8-10"},{"$f":"'C'!R56","v":""},null,"210","-","رشته: مديريت سازمان هاي دولتي ايران- گرایش: سياستگذاري دولتي(خط مشي گذاري عمومي) - دكتري تخصصي - دانشجویان ترم 02 - روزانه و پردیس"]
[{"$f":"ROWS(A$2:C57)","v":56},"دكتري تخصصي","مديريت سازمان هاي دولتي ايران","سياستگذاري دولتي(خط مشي گذاري عمومي)","روزانه و پردیس","نظريه هاي خط مشي گذاري عمومي با رويكرد تطبيقي (اسلام و معاصر)",{"$f":"VLOOKUP(F57,[2]Sheet1!$M:$N,2,FALSE)","v":2},null,"علی احمدی",3982,"ترم 02",3981,"مدیریت و مهندسی کسب و کار",{"$f":"CONCATENATE('C'!O57,CHAR(10),'C'!P57)","v":"دوشنبه\n"},{"$f":"CONCATENATE('C'!Q57,CHAR(10),'C'!R57)","v":"10-12\n"},"208\n-",null,"99/03/31",8,null,null,null,"10-12",null,null,null,null,{"$f":"'C'!O57","v":"دوشنبه"},{"$f":"'C'!P57","v":""},null,{"$f":"'C'!Q57","v":"10-12"},{"$f":"'C'!R57","v":""},null,"208","-","رشته: مديريت سازمان هاي دولتي ايران- گرایش: سياستگذاري دولتي(خط مشي گذاري عمومي) - دكتري تخصصي - دانشجویان ترم 02 - روزانه و پردیس"]
[{"$f":"ROWS(A$2:C58)","v":57},"دكتري تخصصي","مديريت سازمان هاي دولتي ايران","سياستگذاري دولتي(خط مشي گذاري عمومي)","روزانه و پردیس","مطالاعات گروهی",0,null,"رفیعی",3982,"ترم 02",3981,"مدیریت و مهندسی کسب و کار",{"$f":"CONCATENATE('C'!O58,CHAR(10),'C'!P58)","v":"\n"},{"$f":"CONCATENATE('C'!Q58,CHAR(10),'C'!R58)","v":"\n"},"\n-",null,"ندارد","ندارد",null,null,null,null,null,null,null,null,{"$f":"'C'!O58","v":""},{"$f":"'C'!P58","v":""},null,{"$f":"'C'!Q58","v":""},{"$f":"'C'!R58","v":""},null,"","-","رشته: مديريت سازمان هاي دولتي ايران- گرایش: سياستگذاري دولتي(خط مشي گذاري عمومي) - دكتري تخصصي - دانشجویان ترم 02 - روزانه و پردیس"]
[{"$f":"ROWS(A$2:C59)","v":58},"كارشناسي ارشد","مديريت كسب و كار","بازاريابي - استراتژي","پردیس","اخلاق و احكام كسب و كار",{"$f":"VLOOKUP(F59,[2]Sheet1!$M:$N,2,FALSE)","v":3},null,"عبدالحمید",3982,"ترم 02",3981,"مدیریت و مهندسی کسب و کار",{"$f":"CONCATENATE('C'!O59,CHAR(10),'C'!P59)","v":"چهارشنبه\n"},{"$f":"CONCATENATE('C'!Q59,CHAR(10),'C'!R59)","v":"13-16\n"},"213\n-",null,"99/03/27","8",null,null,null,null,null,"13-16",null,null,{"$f":"'C'!O59","v":"چهارشنبه"},{"$f":"'C'!P59","v":""},null,{"$f":"'C'!Q59","v":"13-16"},{"$f":"'C'!R59","v":""},null,"213","-","رشته: مديريت كسب و كار- گرایش: بازاريابي - استراتژي - كارشناسي ارشد - دانشجویان ترم 02 - پردیس"]
[{"$f":"ROWS(A$2:C60)","v":59},"كارشناسي ارشد","مديريت كسب و كار","بازاريابي - استراتژي","روزانه","اخلاق و احكام كسب و كار",{"$f":"VLOOKUP(F60,[2]Sheet1!$M:$N,2,FALSE)","v":3},null,"معینی",3982,"ترم 02",3981,"مدیریت و مهندسی کسب و کار",{"$f":"CONCATENATE('C'!O60,CHAR(10),'C'!P60)","v":"یکشنبه\nسه شنبه"},{"$f":"CONCATENATE('C'!Q60,CHAR(10),'C'!R60)","v":"15-17\n13-15"},"209\n209",null,"99/03/27","8",null,null,"15-17",null,"13-15",null,null,null,{"$f":"'C'!O60","v":"یکشنبه"},{"$f":"'C'!P60","v":"سه شنبه"},null,{"$f":"'C'!Q60","v":"15-17"},{"$f":"'C'!R60","v":"13-15"},null,"209","209","رشته: مديريت كسب و كار- گرایش: بازاريابي - استراتژي - كارشناسي ارشد - دانشجویان ترم 02 - روزانه"]
[{"$f":"ROWS(A$2:C61)","v":60},"كارشناسي ارشد","مديريت كسب و كار","بازاريابي - استراتژي","پردیس","اصول اقتصاد",{"$f":"VLOOKUP(F61,[2]Sheet1!$M:$N,2,FALSE)","v":3},null,"میرزامحمدی",3982,"ترم 02",3981,"مدیریت و مهندسی کسب و کار",{"$f":"CONCATENATE('C'!O61,CHAR(10),'C'!P61)","v":"چهارشنبه\n"},{"$f":"CONCATENATE('C'!Q61,CHAR(10),'C'!R61)","v":"16-19\n"},"210\n-",null,"99/04/01","10",null,null,null,null,null,"16-19",null,null,{"$f":"'C'!O61","v":"چهارشنبه"},{"$f":"'C'!P61","v":""},null,{"$f":"'C'!Q61","v":"16-19"},{"$f":"'C'!R61","v":""},null,"210","-","رشته: مديريت كسب و كار- گرایش: بازاريابي - استراتژي - كارشناسي ارشد - دانشجویان ترم 02 - پردیس"]
[{"$f":"ROWS(A$2:C62)","v":61},"كارشناسي ارشد","مديريت كسب و كار","بازاريابي - استراتژي","روزانه","اصول اقتصاد",{"$f":"VLOOKUP(F62,[2]Sheet1!$M:$N,2,FALSE)","v":3},null,"حکیمی پور",3982,"ترم 02",3981,"مدیریت و مهندسی کسب و کار",{"$f":"CONCATENATE('C'!O62,CHAR(10),'C'!P62)","v":"یکشنبه\nسه شنبه"},{"$f":"CONCATENATE('C'!Q62,CHAR(10),'C'!R62)","v":"10-12\n10-12"},"209\n209",null,"99/03/24","8",null,null,"10-12",null,"10-12",null,null,null,{"$f":"'C'!O62","v":"یکشنبه"},{"$f":"'C'!P62","v":"سه شنبه"},null,{"$f":"'C'!Q62","v":"10-12"},{"$f":"'C'!R62","v":"10-12"},null,"209","209","رشته: مديريت كسب و كار- گرایش: بازاريابي - استراتژي - كارشناسي ارشد - دانشجویان ترم 02 - روزانه"]
[{"$f":"ROWS(A$2:C63)","v":62},"كارشناسي ارشد","مديريت كسب و كار","بازاريابي - استراتژي","پردیس","تصميم گيري براي مديران",{"$f":"VLOOKUP(F63,[2]Sheet1!$M:$N,2,FALSE)","v":3},null,"سبحانی فرد",3982,"ترم 02",3981,"مدیریت و مهندسی کسب و کار",{"$f":"CONCATENATE('C'!O63,CHAR(10),'C'!P63)","v":"چهارشنبه\n"},{"$f":"CONCATENATE('C'!Q63,CHAR(10),'C'!R63)","v":"10-13\n"},"\n-",null,"99/03/31","8",null,null,null,null,null,"10-13",null,null,{"$f":"'C'!O63","v":"چهارشنبه"},{"$f":"'C'!P63","v":""},null,{"$f":"'C'!Q63","v":"10-13"},{"$f":"'C'!R63","v":""},null,"","-","رشته: مديريت كسب و كار- گرایش: بازاريابي - استراتژي - كارشناسي ارشد - دانشجویان ترم 02 - پردیس"]
[{"$f":"ROWS(A$2:C64)","v":63},"كارشناسي ارشد","مديريت كسب و كار","بازاريابي - استراتژي","روزانه","تصميم گيري براي مديران",{"$f":"VLOOKUP(F64,[2]Sheet1!$M:$N,2,FALSE)","v":3},null,"سبحانی فرد",3982,"ترم 02",3981,"مدیریت و مهندسی کسب و کار",{"$f":"CONCATENATE('C'!O64,CHAR(10),'C'!P64)","v":"یکشنبه\nسه شنبه"},{"$f":"CONCATENATE('C'!Q64,CHAR(10),'C'!R64)","v":"13-15\n15-17"},"209\n209",null,"99/03/31","8",null,null,"13-15",null,"15-17",null,null,null,{"$f":"'C'!O64","v":"یکشنبه"},{"$f":"'C'!P64","v":"سه شنبه"},null,{"$f":"'C'!Q64","v":"13-15"},{"$f":"'C'!R64","v":"15-17"},null,"209","209","رشته: مديريت كسب و كار- گرایش: بازاريابي - استراتژي - كارشناسي ارشد - دانشجویان ترم 02 - روزانه"]
[{"$f":"ROWS(A$2:C65)","v":64},"كارشناسي ارشد","مديريت كسب و كار","بازاريابي - استراتژي","روزانه","مدیریت مالی",{"$f":"VLOOKUP(F65,[2]Sheet1!$M:$N,2,FALSE)","v":{"$error":"#N/A"}},null,"بیات",3982,"ترم 04","3971","مدیریت و مهندسی کسب و کار",{"$f":"CONCATENATE('C'!O65,CHAR(10),'C'!P65)","v":"یکشنبه\n"},{"$f":"CONCATENATE('C'!Q65,CHAR(10),'C'!R65)","v":"7-10\n"},"213\n-",null,"99/04/02","8",null,null,"7-10",null,null,null,null,null,{"$f":"'C'!O65","v":"یکشنبه"},{"$f":"'C'!P65","v":""},null,{"$f":"'C'!Q65","v":"7-10"},{"$f":"'C'!R65","v":""},null,"213","-","رشته: مديريت كسب و كار- گرایش: بازاريابي - استراتژي - كارشناسي ارشد - دانشجویان ترم 04 - روزانه"]
[{"$f":"ROWS(A$2:C66)","v":65},"كارشناسي ارشد","مديريت كسب و كار","بازاريابي - استراتژي","پردیس","مديريت رفتار سازماني",{"$f":"VLOOKUP(F66,[2]Sheet1!$M:$N,2,FALSE)","v":2},null,"بنیادی",3982,"ترم 02",3981,"مدیریت و مهندسی کسب و کار",{"$f":"CONCATENATE('C'!O65,CHAR(10),'C'!P65)","v":"یکشنبه\n"},{"$f":"CONCATENATE('C'!Q65,CHAR(10),'C'!R65)","v":"7-10\n"},{"$f":"CONCATENATE(AH66,CHAR(10),AI66)","v":"209\n-"},null,"99/04/05",10,null,null,null,null,null,"7-10",null,null,{"$f":"'C'!O66","v":"چهارشنبه"},{"$f":"'C'!P66","v":""},null,{"$f":"'C'!Q66","v":"7-10"},{"$f":"'C'!R66","v":""},null,"209","-",{"$f":"CONCATENATE(\"رشته: \",C66,\"-\",\" گرایش: \",D66,\" - \",B66,\" - دانشجویان \",K66,\" - \",E66)","v":"رشته: مديريت كسب و كار- گرایش: بازاريابي - استراتژي - كارشناسي ارشد - دانشجویان ترم 02 - پردیس"}]
[{"$f":"ROWS(A$2:C67)","v":66},"كارشناسي ارشد","مديريت كسب و كار","بازاريابي - استراتژي","روزانه","مديريت رفتار سازماني",{"$f":"VLOOKUP(F67,[2]Sheet1!$M:$N,2,FALSE)","v":2},null,"بنیادی",3982,"ترم 02",3981,"مدیریت و مهندسی کسب و کار",{"$f":"CONCATENATE('C'!O66,CHAR(10),'C'!P66)","v":"چهارشنبه\n"},{"$f":"CONCATENATE('C'!Q66,CHAR(10),'C'!R66)","v":"7-10\n"},"209\n209",null,"99/04/05",10,null,null,"8-10",null,"8-10",null,null,null,{"$f":"'C'!O67","v":"یکشنبه"},{"$f":"'C'!P67","v":"سه شنبه"},null,{"$f":"'C'!Q67","v":"8-10"},{"$f":"'C'!R67","v":"8-10"},null,"209","209","رشته: مديريت كسب و كار- گرایش: بازاريابي - استراتژي - كارشناسي ارشد - دانشجویان ترم 02 - روزانه"]
[{"$f":"ROWS(A$2:C68)","v":67},"كارشناسي ارشد","مديريت كسب و كار","بازاريابي","روزانه","تجارت الکترونیک","3",null,"فتحیان",3982,"ترم 04",3971,"مدیریت و مهندسی کسب و کار",{"$f":"CONCATENATE('C'!O68,CHAR(10),'C'!P68)","v":"سه شنبه\n"},{"$f":"CONCATENATE('C'!Q68,CHAR(10),'C'!R68)","v":"15-18\n"},"210\n-",null,"99/03/26",14,null,null,null,null,"15-18",null,null,null,{"$f":"'C'!O68","v":"سه شنبه"},{"$f":"'C'!P68","v":""},null,{"$f":"'C'!Q68","v":"15-18"},{"$f":"'C'!R68","v":""},null,"210","-","رشته: مديريت كسب و كار- گرایش: بازاريابي - كارشناسي ارشد - دانشجویان ترم 04 - روزانه"]
[{"$f":"ROWS(A$2:C69)","v":68},"كارشناسي ارشد","مديريت كسب و كار","بازاريابي","روزانه","رفتار مصرف کننده","3",null,"سبحانی فرد",3982,"ترم 04",3971,"مدیریت و مهندسی کسب و کار",{"$f":"CONCATENATE('C'!O70,CHAR(10),'C'!P70)","v":"پنج شنبه\n"},{"$f":"CONCATENATE('C'!Q70,CHAR(10),'C'!R70)","v":"10-13\n"},"210\n210",null,"99/03/24",14,null,null,"15-17",null,"13-15",null,null,null,{"$f":"'C'!O69","v":"یکشنبه"},{"$f":"'C'!P69","v":"سه شنبه"},null,{"$f":"'C'!Q69","v":"15-17"},{"$f":"'C'!R69","v":"13-15"},null,"210","210","رشته: مديريت كسب و كار- گرایش: بازاريابي - كارشناسي ارشد - دانشجویان ترم 04 - روزانه"]
[{"$f":"ROWS(A$2:C70)","v":69},"كارشناسي ارشد","مديريت كسب و كار","بازاريابي","پردیس","تحقیقات بازاریابی","3",null,"حمیدی زاده",3982,"ترم 04",3971,"مدیریت و مهندسی کسب و کار",{"$f":"CONCATENATE('C'!O71,CHAR(10),'C'!P71)","v":"یکشنبه\n"},{"$f":"CONCATENATE('C'!Q71,CHAR(10),'C'!R71)","v":"10-13\n"},"208\n-",null,"99/03/29",14,null,null,null,null,null,null,"10-13",null,{"$f":"'C'!O70","v":"پنج شنبه"},{"$f":"'C'!P70","v":""},null,{"$f":"'C'!Q70","v":"10-13"},{"$f":"'C'!R70","v":""},null,"208","-","رشته: مديريت كسب و كار- گرایش: بازاريابي - كارشناسي ارشد - دانشجویان ترم 04 - پردیس"]
[{"$f":"ROWS(A$2:C71)","v":70},"كارشناسي ارشد","مديريت كسب و كار","بازاريابي","روزانه","تحقیقات بازاریابی","3",null,"حمیدی زاده",3982,"ترم 04",3971,"مدیریت و مهندسی کسب و کار",{"$f":"CONCATENATE('C'!O72,CHAR(10),'C'!P72)","v":"پنج شنبه\n"},{"$f":"CONCATENATE('C'!Q72,CHAR(10),'C'!R72)","v":"14-17\n"},"210\n-",null,"99/03/29",14,null,null,"10-13",null,null,null,null,null,{"$f":"'C'!O71","v":"یکشنبه"},{"$f":"'C'!P71","v":""},null,{"$f":"'C'!Q71","v":"10-13"},{"$f":"'C'!R71","v":""},null,"210","-","رشته: مديريت كسب و كار- گرایش: بازاريابي - كارشناسي ارشد - دانشجویان ترم 04 - روزانه"]
[{"$f":"ROWS(A$2:C72)","v":71},"كارشناسي ارشد","مديريت كسب و كار","بازاريابي - استراتژي","پردیس","مديريت عملیات",3,null,"محمدی",3982,"ترم 04",3971,"مدیریت و مهندسی کسب و کار",{"$f":"CONCATENATE('C'!O73,CHAR(10),'C'!P73)","v":"یکشنبه\n"},{"$f":"CONCATENATE('C'!Q73,CHAR(10),'C'!R73)","v":"7-10\n"},"207\n-",null,"99/04/02","8",null,null,null,null,null,null,"14-17",null,{"$f":"'C'!O72","v":"پنج شنبه"},{"$f":"'C'!P72","v":""},null,{"$f":"'C'!Q72","v":"14-17"},{"$f":"'C'!R72","v":""},null,"207","-","رشته: مديريت كسب و كار- گرایش: بازاريابي - استراتژي - كارشناسي ارشد - دانشجویان ترم 04 - پردیس"]
[{"$f":"ROWS(A$2:C73)","v":72},"كارشناسي ارشد","مديريت كسب و كار","بازاريابي - استراتژي","روزانه","مديريت مالي","3",null,"بیات",3982,"ترم 04",3971,"مدیریت و مهندسی کسب و کار",{"$f":"CONCATENATE('C'!O74,CHAR(10),'C'!P74)","v":"پنج شنبه\n"},{"$f":"CONCATENATE('C'!Q74,CHAR(10),'C'!R74)","v":"7-10\n"},"213\n-",null,"99/04/02","8",null,null,"7-10",null,null,null,null,null,{"$f":"'C'!O73","v":"یکشنبه"},{"$f":"'C'!P73","v":""},null,{"$f":"'C'!Q73","v":"7-10"},{"$f":"'C'!R73","v":""},null,"213","-","رشته: مديريت كسب و كار- گرایش: بازاريابي - استراتژي - كارشناسي ارشد - دانشجویان ترم 04 - روزانه"]
[{"$f":"ROWS(A$2:C74)","v":73},"كارشناسي ارشد","مديريت كسب و كار","استراتژي","پردیس","مدیریت استراتژیک پیشرفته","3",null,"حمیدی زاده",3982,"ترم 04",3971,"مدیریت و مهندسی کسب و کار",{"$f":"CONCATENATE('C'!O75,CHAR(10),'C'!P75)","v":"یکشنبه\nسه شنبه"},{"$f":"CONCATENATE('C'!Q75,CHAR(10),'C'!R75)","v":"15-17\n15-17"},"208\n-",null,"99/04/04","8",null,null,null,null,null,null,"7-10",null,{"$f":"'C'!O74","v":"پنج شنبه"},{"$f":"'C'!P74","v":""},null,{"$f":"'C'!Q74","v":"7-10"},{"$f":"'C'!R74","v":""},null,"208","-","رشته: مديريت كسب و كار- گرایش: استراتژي - كارشناسي ارشد - دانشجویان ترم 04 - پردیس"]
[{"$f":"ROWS(A$2:C75)","v":74},"كارشناسي ارشد","مديريت كسب و كار","استراتژي","روزانه","پیاده سازی استراتژی","3",null,"نورعلیزاده","3982","ترم 04","3971","مدیریت و مهندسی کسب و کار",{"$f":"CONCATENATE('C'!O76,CHAR(10),'C'!P76)","v":"چهارشنبه\n"},{"$f":"CONCATENATE('C'!Q76,CHAR(10),'C'!R76)","v":"15-18\n"},"213\n213",null,"99/03/29",10,null,null,"15-17",null,"15-17",null,null,null,{"$f":"'C'!O75","v":"یکشنبه"},{"$f":"'C'!P75","v":"سه شنبه"},null,{"$f":"'C'!Q75","v":"15-17"},{"$f":"'C'!R75","v":"15-17"},null,"213","213","رشته: مديريت كسب و كار- گرایش: استراتژي - كارشناسي ارشد - دانشجویان ترم 04 - روزانه"]
[{"$f":"ROWS(A$2:C76)","v":75},"كارشناسي ارشد","مديريت كسب و كار","استراتژي","پردیس","مدیریت اتحادهای اسراتژیک","3",null,"علی احمدی","3982","ترم 04","3971","مدیریت و مهندسی کسب و کار",{"$f":"CONCATENATE('C'!O77,CHAR(10),'C'!P77)","v":"سه شنبه\n"},{"$f":"CONCATENATE('C'!Q77,CHAR(10),'C'!R77)","v":"7-10\n"},"213\n-",null,"99/03/24",10,null,null,null,null,null,"15-18",null,null,{"$f":"'C'!O76","v":"چهارشنبه"},{"$f":"'C'!P76","v":""},null,{"$f":"'C'!Q76","v":"15-18"},{"$f":"'C'!R76","v":""},null,"213","-","رشته: مديريت كسب و كار- گرایش: استراتژي - كارشناسي ارشد - دانشجویان ترم 04 - پردیس"]
[{"$f":"ROWS(A$2:C77)","v":76},"كارشناسي ارشد","مديريت كسب و كار","استراتژي","روزانه","مباحث منتخب","3",null,"رضایی","3982","ترم 04","3971","مدیریت و مهندسی کسب و کار",{"$f":"CONCATENATE('C'!O78,CHAR(10),'C'!P78)","v":"چهارشنبه\n"},{"$f":"CONCATENATE('C'!Q78,CHAR(10),'C'!R78)","v":"10-13\n"},"210\n-",null,"99/03/31","8",null,null,null,null,"7-10",null,null,null,{"$f":"'C'!O77","v":"سه شنبه"},{"$f":"'C'!P77","v":""},null,{"$f":"'C'!Q77","v":"7-10"},{"$f":"'C'!R77","v":""},null,"210","-","رشته: مديريت كسب و كار- گرایش: استراتژي - كارشناسي ارشد - دانشجویان ترم 04 - روزانه"]
[{"$f":"ROWS(A$2:C78)","v":77},"كارشناسي ارشد","مديريت كسب و كار","استراتژي","پردیس","مدیریت استراتژیک فناوری","3",null,"ذاکری","3982","ترم 04","3971","مدیریت و مهندسی کسب و کار",{"$f":"CONCATENATE('C'!O79,CHAR(10),'C'!P79)","v":"یکشنبه\nسه شنبه"},{"$f":"CONCATENATE('C'!Q79,CHAR(10),'C'!R79)","v":"10-12\n10-12"},"\n-",null,"99/03/26",10,null,null,null,null,null,"10-13",null,null,{"$f":"'C'!O78","v":"چهارشنبه"},{"$f":"'C'!P78","v":""},null,{"$f":"'C'!Q78","v":"10-13"},{"$f":"'C'!R78","v":""},null,"","-","رشته: مديريت كسب و كار- گرایش: استراتژي - كارشناسي ارشد - دانشجویان ترم 04 - پردیس"]
[{"$f":"ROWS(A$2:C79)","v":78},"كارشناسي ارشد","مديريت كسب و كار","استراتژي","روزانه","مدیریت استراتژیک فناوری","3",null,"ذاکری","3982","ترم 04","3971","مدیریت و مهندسی کسب و کار",{"$f":"CONCATENATE('C'!O80,CHAR(10),'C'!P80)","v":"\n"},{"$f":"CONCATENATE('C'!Q80,CHAR(10),'C'!R80)","v":"\n"},"213\n210",null,"99/03/26",10,null,null,"10-12",null,"10-12",null,null,null,{"$f":"'C'!O79","v":"یکشنبه"},{"$f":"'C'!P79","v":"سه شنبه"},null,{"$f":"'C'!Q79","v":"10-12"},{"$f":"'C'!R79","v":"10-12"},null,"213","210","رشته: مديريت كسب و كار- گرایش: استراتژي - كارشناسي ارشد - دانشجویان ترم 04 - روزانه"]
[{"$f":"ROWS(A$2:C80)","v":79},"كارشناسي ارشد","مديريت كسب و كار","بازاريابي - استراتژي","پردیس","پایان نامه",6,null,null,3982,"ترم 04 و بیشتر","3971 و قبل تر","مدیریت و مهندسی کسب و کار",{"$f":"CONCATENATE('C'!O81,CHAR(10),'C'!P81)","v":"\n"},{"$f":"CONCATENATE('C'!Q81,CHAR(10),'C'!R81)","v":"\n"},"\n-",null,null,null,null,null,null,null,null,null,null,null,{"$f":"'C'!O80","v":""},{"$f":"'C'!P80","v":""},null,{"$f":"'C'!Q80","v":""},{"$f":"'C'!R80","v":""},null,"","-","رشته: مديريت كسب و كار- گرایش: بازاريابي - استراتژي - كارشناسي ارشد - دانشجویان ترم 04 و بیشتر - پردیس"]
[{"$f":"ROWS(A$2:C81)","v":80},"كارشناسي ارشد","مديريت كسب و كار","بازاريابي - استراتژي","روزانه","پایان نامه",6,null,null,3982,"ترم 04 و بیشتر","3971 و قبل تر","مدیریت و مهندسی کسب و کار",{"$f":"CONCATENATE('C'!O82,CHAR(10),'C'!P82)","v":"شنبه\nیکشنبه"},{"$f":"CONCATENATE('C'!Q82,CHAR(10),'C'!R82)","v":"\n"},"\n-",null,null,null,null,null,null,null,null,null,null,null,{"$f":"'C'!O81","v":""},{"$f":"'C'!P81","v":""},null,{"$f":"'C'!Q81","v":""},{"$f":"'C'!R81","v":""},null,"","-","رشته: مديريت كسب و كار- گرایش: بازاريابي - استراتژي - كارشناسي ارشد - دانشجویان ترم 04 و بیشتر - روزانه"]
[{"$f":"ROWS(A$2:C82)","v":81},"كارشناسي ارشد","مديريت فناوري اطلاعات","كسب و كار الكترونيك","آموزش الکترونیکی","بازاریابی الکترونیکی",2,null,"امیری-رسولی","3991","ترم 03","3981","مدیریت و فلسفه علم و فناوری",{"$f":"CONCATENATE('C'!O83,CHAR(10),'C'!P83)","v":"\n"},{"$f":"CONCATENATE('C'!Q83,CHAR(10),'C'!R83)","v":"\n"},{"$f":"CONCATENATE(AH82,CHAR(10),AI82)","v":"\n-"},null,null,null,null,null,null,null,null,null,null,null,{"$f":"'C'!O82","v":"شنبه"},{"$f":"'C'!P82","v":"یکشنبه"},null,{"$f":"'C'!Q82","v":""},{"$f":"'C'!R82","v":""},null,"","-",{"$f":"CONCATENATE(\"رشته: \",C82,\"-\",\" گرایش: \",D82,\" - \",B82,\" - دانشجویان \",K82,\" - \",E82)","v":"رشته: مديريت فناوري اطلاعات- گرایش: كسب و كار الكترونيك - كارشناسي ارشد - دانشجویان ترم 03 - آموزش الکترونیکی"}]
[{"$f":"ROWS(A$2:C83)","v":82},"كارشناسي ارشد","كارآفريني","كسب و كار جديد","روزانه و پردیس","ایجاد کسب و کار",2,null,"احسانی","3991","ترم 03",3981,"مدیریت و فلسفه علم و فناوری",{"$f":"CONCATENATE('C'!O135,CHAR(10),'C'!P135)","v":"\n"},{"$f":"CONCATENATE('C'!Q135,CHAR(10),'C'!R135)","v":"\n"},{"$f":"CONCATENATE(AH83,CHAR(10),AI83)","v":"\n-"},null,null,null,null,null,null,null,null,"14:30-16",null,null,"شنبه",null,null,"13-15",null,null,"","-","رشته: كارآفريني- گرایش: كسب و كار جديد - كارشناسي ارشد - دانشجویان ترم 03 - روزانه و پردیس"]
[null,"كارشناسي ارشد","مدیریت تکنولوزی","نوآوری","روزانه و پردیس","تکنولوژی نو و محیط زیست",2,null,"احمدی",3991,"ترم 03","3981","مدیریت و مهندسی کسب وکار",null,null,null,null,null,null,null,null,null,"17:30-19",null,null,null,null,"دوشنبه","شنبه",null,"9-10:30","17-18:30",null,"","-","رشته: مدیریت تکنولوزی- گرایش: نوآوری - كارشناسي ارشد - دانشجویان ترم 03 - روزانه و پردیس"]
[{"$f":"ROWS(A$2:C85)","v":84},"كارشناسي ارشد","مديريت فناوري اطلاعات","كسب و كار الكترونيك","آموزش الکترونیکی","تجارت کسب و کار الکترونیک",2,null,"خانی زاد","3991","ترم 03","3981","مدیریت و فلسفه علم و فناوری",{"$f":"CONCATENATE('C'!O84,CHAR(10),'C'!P84)","v":"\n"},{"$f":"CONCATENATE('C'!Q84,CHAR(10),'C'!R84)","v":"\n"},{"$f":"CONCATENATE(AH85,CHAR(10),AI85)","v":"\n-"},null,null,null,null,null,null,null,null,null,null,null,{"$f":"'C'!O85","v":0},{"$f":"'C'!P85","v":0},null,{"$f":"'C'!Q85","v":0},{"$f":"'C'!R85","v":0},null,"","-","رشته: مديريت فناوري اطلاعات- گرایش: كسب و كار الكترونيك - كارشناسي ارشد - دانشجویان ترم 03 - آموزش الکترونیکی"]
[{"$f":"ROWS(A$2:C86)","v":85},"كارشناسي ارشد","مدیریت کسب و کار","بازاریابی","روزانه و پردیس","تحقیقات بازاریابی",3,null,"امیرحامد رضایی","3991","ترم 03","3981","مدیریت و مهندسی کسب وکار",{"$f":"CONCATENATE('C'!O187,CHAR(10),'C'!P187)","v":"\n"},{"$f":"CONCATENATE('C'!Q187,CHAR(10),'C'!R187)","v":"\n"},"\n-",null,null,null,null,null,null,null,"8-10",null,null,null,"دوشنبه",null,null,"14-16",{"$f":"'C'!R86","v":0},null,"","-","رشته: مدیریت کسب و کار- گرایش: بازاریابی - كارشناسي ارشد - دانشجویان ترم 03 - روزانه و پردیس"]
[{"$f":"ROWS(A$2:C87)","v":86},"دکتری","مدیریت تکنولوزی",null,"روزانه و پردیس","سیاست های علوم و تکنولوژی",2,null,"باقری مقدم","3991","ترم 01","3991","مدیریت و مهندسی کسب وکار",{"$f":"CONCATENATE('C'!O140,CHAR(10),'C'!P140)","v":"\n"},{"$f":"CONCATENATE('C'!Q140,CHAR(10),'C'!R140)","v":"\n"},"\n-",null,null,null,null,null,null,"15-17",null,null,null,null,"شنبه","دوشنبه",null,{"$f":"'C'!Q87","v":0},"7:30-9",null,"","-","رشته: مدیریت تکنولوزی- گرایش:  - دکتری - دانشجویان ترم 01 - روزانه و پردیس"]
[{"$f":"ROWS(A$2:C88)","v":87},"كارشناسي ارشد","مديريت فناوري اطلاعات","كسب و كار الكترونيك","آموزش الکترونیکی","سیستم های سازمانی",2,null,"ساعی شاهی-کرمانی-پیشوایی-شریف موسوی","3991","ترم 03","3981","مدیریت و فلسفه علم و فناوری",{"$f":"CONCATENATE('C'!O85,CHAR(10),'C'!P85)","v":"\n"},{"$f":"CONCATENATE('C'!Q85,CHAR(10),'C'!R85)","v":"\n"},"\n-",null,null,null,null,null,null,null,null,null,null,null,{"$f":"'C'!O88","v":0},{"$f":"'C'!P88","v":0},null,{"$f":"'C'!Q88","v":0},{"$f":"'C'!R88","v":0},null,"","-","رشته: مديريت فناوري اطلاعات- گرایش: كسب و كار الكترونيك - كارشناسي ارشد - دانشجویان ترم 03 - آموزش الکترونیکی"]
[{"$f":"ROWS(A$2:C89)","v":88},"دکتری","مدیریت تکنولوزی",null,"روزانه و پردیس","روش تحقیق",2,null,"بنیادی","3991","ترم 01","3991","مدیریت و مهندسی کسب وکار",{"$f":"CONCATENATE('C'!O143,CHAR(10),'C'!P143)","v":"\n"},{"$f":"CONCATENATE('C'!Q143,CHAR(10),'C'!R143)","v":"\n"},"\n-",null,null,null,null,null,null,"9-10:30","16:30-18",null,null,null,"شنبه","دوشنبه",null,"10:30-12","13-14:30",null,"","-","رشته: مدیریت تکنولوزی- گرایش:  - دکتری - دانشجویان ترم 01 - روزانه و پردیس"]
[{"$f":"ROWS(A$2:C90)","v":89},"كارشناسي ارشد","مدیریت تکنولوزی",null,"روزانه و پردیس","نظریه های مدیریت پیشرفته",2,null,"بنیادی","3991","ترم 01","3991","مدیریت و مهندسی کسب وکار",{"$f":"CONCATENATE('C'!O156,CHAR(10),'C'!P156)","v":"\n"},{"$f":"CONCATENATE('C'!Q156,CHAR(10),'C'!R156)","v":"\n"},"\n-",null,null,null,null,null,null,"10:30-12","16:30-18",null,null,null,"شنبه",null,null,"15-17",null,null,"","-","رشته: مدیریت تکنولوزی- گرایش:  - كارشناسي ارشد - دانشجویان ترم 01 - روزانه و پردیس"]
[{"$f":"ROWS(A$2:C91)","v":90},"كارشناسي ارشد","مديريت فناوري اطلاعات","كسب و كار الكترونيك","آموزش الکترونیکی","مبانی تئوری فلسفی سیستم های اطلاعاتی",2,null,"رفیعی","3991","ترم 03","3981","مدیریت و فلسفه علم و فناوری",{"$f":"CONCATENATE('C'!O86,CHAR(10),'C'!P86)","v":"\n"},{"$f":"CONCATENATE('C'!Q86,CHAR(10),'C'!R86)","v":"\n"},"\n-",null,null,null,null,null,null,null,null,null,null,null,{"$f":"'C'!O91","v":0},{"$f":"'C'!P91","v":0},null,{"$f":"'C'!Q91","v":0},{"$f":"'C'!R91","v":0},null,"","-","رشته: مديريت فناوري اطلاعات- گرایش: كسب و كار الكترونيك - كارشناسي ارشد - دانشجویان ترم 03 - آموزش الکترونیکی"]
[{"$f":"ROWS(A$2:C92)","v":91},"كارشناسي ارشد","مدیریت کسب و کار",null,"روزانه و پردیس","مدیریت بازاریابی",3,null,"بنیادی","3991","ترم 01","3991","مدیریت و مهندسی کسب وکار",{"$f":"CONCATENATE('C'!O195,CHAR(10),'C'!P195)","v":"\n"},{"$f":"CONCATENATE('C'!Q195,CHAR(10),'C'!R195)","v":"\n"},"\n-",null,null,null,null,null,"9-10:30",null,"9-10:30",null,null,null,"شنبه","چهارشنبه","15:30-17","15:30-17",null,null,"","-","رشته: مدیریت کسب و کار- گرایش:  - كارشناسي ارشد - دانشجویان ترم 01 - روزانه و پردیس"]
[{"$f":"ROWS(A$2:C93)","v":92},"كارشناسي ارشد","كارآفريني","كسب و كار جديد","روزانه و پردیس","تئوری های کارآفرینی(اصلی) ",2,null,"پارسانژاد","3991","ترم 01","3991","مدیریت و فلسفه علم و فناوری",{"$f":"CONCATENATE('C'!O124,CHAR(10),'C'!P124)","v":"\n"},{"$f":"CONCATENATE('C'!Q124,CHAR(10),'C'!R124)","v":"\n"},"\n-",null,null,null,null,null,null,null,null,"13-15",null,null,{"$f":"'C'!O94","v":0},{"$f":"'C'!P94","v":0},null,{"$f":"'C'!Q94","v":0},{"$f":"'C'!R94","v":0},null,"","-","رشته: كارآفريني- گرایش: كسب و كار جديد - كارشناسي ارشد - دانشجویان ترم 01 - روزانه و پردیس"]
[{"$f":"ROWS(A$2:C94)","v":93},"كارشناسي ارشد","مديريت فناوري اطلاعات","كسب و كار الكترونيك","آموزش الکترونیکی","هوشمندی کسب و کار",2,null,"غضنفری-کریمی مجد","3991","ترم 03","3981","مدیریت و فلسفه علم و فناوری",{"$f":"CONCATENATE('C'!O87,CHAR(10),'C'!P87)","v":"\n"},{"$f":"CONCATENATE('C'!Q87,CHAR(10),'C'!R87)","v":"\n"},"\n-",null,null,null,null,null,null,null,null,null,null,null,{"$f":"'C'!O95","v":0},{"$f":"'C'!P95","v":0},null,{"$f":"'C'!Q95","v":0},{"$f":"'C'!R95","v":0},null,"","-","رشته: مديريت فناوري اطلاعات- گرایش: كسب و كار الكترونيك - كارشناسي ارشد - دانشجویان ترم 03 - آموزش الکترونیکی"]
[{"$f":"ROWS(A$2:C95)","v":94},"كارشناسي ارشد","كارآفريني","كسب و كار جديد","روزانه و پردیس","مدیریت کسب و کارهای کوچک",2,null,"پارسانژاد","3991","ترم 03",3981,"مدیریت و فلسفه علم و فناوری",{"$f":"CONCATENATE('C'!O137,CHAR(10),'C'!P137)","v":"\n"},{"$f":"CONCATENATE('C'!Q137,CHAR(10),'C'!R137)","v":"\n"},"\n-",null,null,null,null,null,null,null,null,"10:30-12",null,null,"سه شنبه",{"$f":"'C'!P131","v":0},null,{"$f":"'C'!Q131","v":0},{"$f":"'C'!R131","v":0},null,"","-",{"$f":"CONCATENATE(\"رشته: \",C95,\"-\",\" گرایش: \",D95,\" - \",B95,\" - دانشجویان \",K95,\" - \",E95)","v":"رشته: كارآفريني- گرایش: كسب و كار جديد - كارشناسي ارشد - دانشجویان ترم 03 - روزانه و پردیس"}]
[{"$f":"ROWS(A$2:C96)","v":95},"كارشناسي ارشد","مديريت فناوري اطلاعات","كسب و كار الكترونيك","روزانه و پردیس","راه اندازی استارتاپ ها",2,null,"پارسانژاد",3991,"ترم 01",3991,"مدیریت و فلسفه علم و فناوری",{"$f":"CONCATENATE('C'!O111,CHAR(10),'C'!P111)","v":"\n"},{"$f":"CONCATENATE('C'!Q111,CHAR(10),'C'!R111)","v":"\n"},"\n-",null,null,null,null,null,null,null,null,"8-10",null,null,"دوشنبه","سه شنبه",null,"07:30-10","10:30-12",null,"","-","رشته: مديريت فناوري اطلاعات- گرایش: كسب و كار الكترونيك - كارشناسي ارشد - دانشجویان ترم 01 - روزانه و پردیس"]
[{"$f":"ROWS(A$2:C97)","v":96},"كارشناسي ارشد","مدیریت تکنولوزی",null,"روزانه و پردیس","سازمان های تحقیق و توسعه , پارک های تحقیقاتی صنعتی",2,null,"پورعمران","3991","ترم 03","3981","مدیریت و مهندسی کسب وکار",{"$f":"CONCATENATE('C'!O148,CHAR(10),'C'!P148)","v":"\n"},{"$f":"CONCATENATE('C'!Q148,CHAR(10),'C'!R148)","v":"\n"},"\n-",null,null,null,null,null,null,"16-17:30",null,null,null,null,"دوشنبه","چهارشنبه","شنبه","10:30-12","7:30-9","9-10","","-","رشته: مدیریت تکنولوزی- گرایش:  - كارشناسي ارشد - دانشجویان ترم 03 - روزانه و پردیس"]
[{"$f":"ROWS(A$2:C98)","v":97},"كارشناسي ارشد","مديريت فناوري اطلاعات","كسب و كار الكترونيك","آموزش الکترونیکی","بازاریابی الکترونیکی",2,null,"امیری-رسولی","3991","ترم 02","3982","مدیریت و فلسفه علم و فناوری",{"$f":"CONCATENATE('C'!O88,CHAR(10),'C'!P88)","v":"\n"},{"$f":"CONCATENATE('C'!Q88,CHAR(10),'C'!R88)","v":"\n"},"\n-",null,null,null,null,null,null,null,null,null,null,null,{"$f":"'C'!O98","v":0},{"$f":"'C'!P98","v":0},null,{"$f":"'C'!Q98","v":0},{"$f":"'C'!R98","v":0},null,"","-","رشته: مديريت فناوري اطلاعات- گرایش: كسب و كار الكترونيك - كارشناسي ارشد - دانشجویان ترم 02 - آموزش الکترونیکی"]
[{"$f":"ROWS(A$2:C99)","v":98},"كارشناسي ارشد","مديريت فناوري اطلاعات","كسب و كار الكترونيك","آموزش الکترونیکی","تجارت کسب و کار الکترونیک",2,null,"خانی زاد","3991","ترم 02","3982","مدیریت و فلسفه علم و فناوری",{"$f":"CONCATENATE('C'!O89,CHAR(10),'C'!P89)","v":"\n"},{"$f":"CONCATENATE('C'!Q89,CHAR(10),'C'!R89)","v":"\n"},"\n-",null,null,null,null,null,null,null,null,null,null,null,{"$f":"'C'!O99","v":0},{"$f":"'C'!P99","v":0},null,{"$f":"'C'!Q99","v":0},{"$f":"'C'!R99","v":0},null,"","-","رشته: مديريت فناوري اطلاعات- گرایش: كسب و كار الكترونيك - كارشناسي ارشد - دانشجویان ترم 02 - آموزش الکترونیکی"]
[{"$f":"ROWS(A$2:C100)","v":99},"كارشناسي ارشد","مديريت فناوري اطلاعات","كسب و كار الكترونيك","آموزش الکترونیکی","راه اندازی استارتاپ ها","2",null,"پارسا نژاد",3992,"ترم 03",3982,"مدیریت و فلسفه علم و فناوری",{"$f":"CONCATENATE('C'!O141,CHAR(10),'C'!P141)","v":"\n"},{"$f":"CONCATENATE('C'!Q141,CHAR(10),'C'!R141)","v":"\n"},"\n-",null,null,null,null,null,null,null,null,null,null,null,{"$f":"'C'!O100","v":0},{"$f":"'C'!P100","v":0},null,{"$f":"'C'!Q100","v":0},{"$f":"'C'!R100","v":0},null,"","-","رشته: مديريت فناوري اطلاعات- گرایش: كسب و كار الكترونيك - كارشناسي ارشد - دانشجویان ترم 03 - آموزش الکترونیکی"]
[{"$f":"ROWS(A$2:C101)","v":100},"كارشناسي ارشد","مديريت فناوري اطلاعات","كسب و كار الكترونيك","آموزش الکترونیکی","روش تحقیق","2",null,"عبدالحمید-محمدی-بنیادی",3992,"ترم 03",3982,"مدیریت و فلسفه علم و فناوری",{"$f":"CONCATENATE('C'!O142,CHAR(10),'C'!P142)","v":"\n"},{"$f":"CONCATENATE('C'!Q142,CHAR(10),'C'!R142)","v":"\n"},"\n-",null,null,null,null,null,null,null,null,null,null,null,{"$f":"'C'!O101","v":0},{"$f":"'C'!P101","v":0},null,{"$f":"'C'!Q101","v":0},{"$f":"'C'!R101","v":0},null,"","-","رشته: مديريت فناوري اطلاعات- گرایش: كسب و كار الكترونيك - كارشناسي ارشد - دانشجویان ترم 03 - آموزش الکترونیکی"]
[{"$f":"ROWS(A$2:C102)","v":101},"كارشناسي ارشد","مديريت فناوري اطلاعات","كسب و كار الكترونيك","آموزش الکترونیکی","سیستم های سازمانی",2,null,"ساعی شاهی-کرمانی-پیشوایی-شریف موسوی","3991","ترم 02","3982","مدیریت و فلسفه علم و فناوری",{"$f":"CONCATENATE('C'!O90,CHAR(10),'C'!P90)","v":"\n"},{"$f":"CONCATENATE('C'!Q90,CHAR(10),'C'!R90)","v":"\n"},"\n-",null,null,null,null,null,null,null,null,null,null,null,{"$f":"'C'!O102","v":0},{"$f":"'C'!P102","v":0},null,{"$f":"'C'!Q102","v":0},{"$f":"'C'!R102","v":0},null,"","-","رشته: مديريت فناوري اطلاعات- گرایش: كسب و كار الكترونيك - كارشناسي ارشد - دانشجویان ترم 02 - آموزش الکترونیکی"]
[{"$f":"ROWS(A$2:C103)","v":102},"كارشناسي ارشد","مديريت فناوري اطلاعات","كسب و كار الكترونيك","آموزش الکترونیکی","سیستم های مدیریت بانک های اطلاعاتی","2",null,"رسولی-کریمی مجد",3992,"ترم 03",3982,"مدیریت و فلسفه علم و فناوری",{"$f":"CONCATENATE('C'!O143,CHAR(10),'C'!P143)","v":"\n"},{"$f":"CONCATENATE('C'!Q143,CHAR(10),'C'!R143)","v":"\n"},"\n-",null,null,null,null,null,null,null,null,null,null,null,{"$f":"'C'!O103","v":0},{"$f":"'C'!P103","v":0},null,{"$f":"'C'!Q103","v":0},{"$f":"'C'!R103","v":0},null,"","-","رشته: مديريت فناوري اطلاعات- گرایش: كسب و كار الكترونيك - كارشناسي ارشد - دانشجویان ترم 03 - آموزش الکترونیکی"]
[{"$f":"ROWS(A$2:C104)","v":103},"كارشناسي ارشد","مديريت فناوري اطلاعات","كسب و كار الكترونيك","آموزش الکترونیکی","مبانی تئوری فلسفی سیستم های اطلاعاتی",2,null,"رفیعی","3991","ترم 02","3982","مدیریت و فلسفه علم و فناوری",{"$f":"CONCATENATE('C'!O91,CHAR(10),'C'!P91)","v":"\n"},{"$f":"CONCATENATE('C'!Q91,CHAR(10),'C'!R91)","v":"\n"},"\n-",null,null,null,null,null,null,null,null,null,null,null,{"$f":"'C'!O104","v":0},{"$f":"'C'!P104","v":0},null,{"$f":"'C'!Q104","v":0},{"$f":"'C'!R104","v":0},null,"","-","رشته: مديريت فناوري اطلاعات- گرایش: كسب و كار الكترونيك - كارشناسي ارشد - دانشجویان ترم 02 - آموزش الکترونیکی"]
[{"$f":"ROWS(A$2:C105)","v":104},"كارشناسي ارشد","مديريت فناوري اطلاعات","كسب و كار الكترونيك","آموزش الکترونیکی","مبانی زیر ساخت های فناوری اطلاعات","2",null,"فتحیان",3992,"ترم 03",3982,"مدیریت و فلسفه علم و فناوری",{"$f":"CONCATENATE('C'!O144,CHAR(10),'C'!P144)","v":"\n"},{"$f":"CONCATENATE('C'!Q144,CHAR(10),'C'!R144)","v":"\n"},"\n-",null,null,null,null,null,null,null,null,null,null,null,{"$f":"'C'!O105","v":0},{"$f":"'C'!P105","v":0},null,{"$f":"'C'!Q105","v":0},{"$f":"'C'!R105","v":0},null,"","-","رشته: مديريت فناوري اطلاعات- گرایش: كسب و كار الكترونيك - كارشناسي ارشد - دانشجویان ترم 03 - آموزش الکترونیکی"]
[{"$f":"ROWS(A$2:C106)","v":105},"كارشناسي ارشد","مديريت فناوري اطلاعات","كسب و كار الكترونيك","آموزش الکترونیکی","مبانی مدیریت دانش","2",null,"اخوان-ذاکری",3992,"ترم 03",3982,"مدیریت و فلسفه علم و فناوری",{"$f":"CONCATENATE('C'!O145,CHAR(10),'C'!P145)","v":"\n"},{"$f":"CONCATENATE('C'!Q145,CHAR(10),'C'!R145)","v":"\n"},"\n-",null,null,null,null,null,null,null,null,null,null,null,{"$f":"'C'!O106","v":0},{"$f":"'C'!P106","v":0},null,{"$f":"'C'!Q106","v":0},{"$f":"'C'!R106","v":0},null,"","-","رشته: مديريت فناوري اطلاعات- گرایش: كسب و كار الكترونيك - كارشناسي ارشد - دانشجویان ترم 03 - آموزش الکترونیکی"]
[{"$f":"ROWS(A$2:C107)","v":106},"كارشناسي ارشد","مديريت فناوري اطلاعات","كسب و كار الكترونيك","آموزش الکترونیکی","هوشمندی کسب و کار",2,null,"غضنفری-کریمی مجد","3991","ترم 02","3982","مدیریت و فلسفه علم و فناوری",{"$f":"CONCATENATE('C'!O92,CHAR(10),'C'!P92)","v":"\n"},{"$f":"CONCATENATE('C'!Q92,CHAR(10),'C'!R92)","v":"\n"},"\n-",null,null,null,null,null,null,null,null,null,null,null,{"$f":"'C'!O107","v":0},{"$f":"'C'!P107","v":0},null,{"$f":"'C'!Q107","v":0},{"$f":"'C'!R107","v":0},null,"","-","رشته: مديريت فناوري اطلاعات- گرایش: كسب و كار الكترونيك - كارشناسي ارشد - دانشجویان ترم 02 - آموزش الکترونیکی"]
[{"$f":"ROWS(A$2:C108)","v":107},"كارشناسي ارشد","مديريت فناوري اطلاعات","كسب و كار الكترونيك","آموزش الکترونیکی","راه اندازی استارتاپ ها","2",null,"پارسا نژاد",3991,"ترم 01",3991,"مدیریت و فلسفه علم و فناوری",{"$f":"CONCATENATE('C'!O146,CHAR(10),'C'!P146)","v":"\n"},{"$f":"CONCATENATE('C'!Q146,CHAR(10),'C'!R146)","v":"\n"},"\n-",null,null,null,null,null,null,null,null,null,null,null,{"$f":"'C'!O108","v":0},{"$f":"'C'!P108","v":0},null,{"$f":"'C'!Q108","v":0},{"$f":"'C'!R108","v":0},null,"","-","رشته: مديريت فناوري اطلاعات- گرایش: كسب و كار الكترونيك - كارشناسي ارشد - دانشجویان ترم 01 - آموزش الکترونیکی"]
[{"$f":"ROWS(A$2:C109)","v":108},"كارشناسي ارشد","مديريت فناوري اطلاعات","كسب و كار الكترونيك","آموزش الکترونیکی","روش تحقیق","2",null,"عبدالحمید",3991,"ترم 01",3991,"مدیریت و فلسفه علم و فناوری",null,null,null,null,null,null,null,null,null,null,null,null,null,null,{"$f":"'C'!O109","v":0},{"$f":"'C'!P109","v":0},null,{"$f":"'C'!Q109","v":0},{"$f":"'C'!R109","v":0},null,"","-","رشته: مديريت فناوري اطلاعات- گرایش: كسب و كار الكترونيك - كارشناسي ارشد - دانشجویان ترم 01 - آموزش الکترونیکی"]
[{"$f":"ROWS(A$2:C110)","v":109},"كارشناسي ارشد","مديريت فناوري اطلاعات","كسب و كار الكترونيك","آموزش الکترونیکی","سیستم های مدیریت بانک های اطلاعاتی","2",null,"رسولی-کریمی مجد",3991,"ترم 01",3991,"مدیریت و فلسفه علم و فناوری",null,null,null,null,null,null,null,null,null,null,null,null,null,null,{"$f":"'C'!O110","v":0},{"$f":"'C'!P110","v":0},null,{"$f":"'C'!Q110","v":0},{"$f":"'C'!R110","v":0},null,"","-","رشته: مديريت فناوري اطلاعات- گرایش: كسب و كار الكترونيك - كارشناسي ارشد - دانشجویان ترم 01 - آموزش الکترونیکی"]
[{"$f":"ROWS(A$2:C111)","v":110},"كارشناسي ارشد","علوم اقتصادی","اقتصاد اسلامی","روزانه","موضوعات انتخابی در اقتصاد",3,null,"حکیمی پور",3991,"ترم 01",3991,"مهندسی پیشرفت اقتصادی",{"$f":"CONCATENATE('C'!O117,CHAR(10),'C'!P117)","v":"\n"},{"$f":"CONCATENATE('C'!Q117,CHAR(10),'C'!R117)","v":"\n"},{"$f":"CONCATENATE(AH111,CHAR(10),AI111)","v":"\n-"},null,null,null,null,"10:30-12",null,null,null,"9-10:30",null,null,"شنبه","چهارشنبه",null,"10:30-12","10:30-12",null,"","-","رشته: علوم اقتصادی- گرایش: اقتصاد اسلامی - كارشناسي ارشد - دانشجویان ترم 01 - روزانه"]
[{"$f":"ROWS(A$2:C112)","v":111},"كارشناسي ارشد","مدیریت تکنولوزی",null,"روزانه و پردیس","تئوری های اقتصادی و سیر تحول تکنولوژی",2,null,"حکیمی پور","3991","ترم 03","3981","مدیریت و مهندسی کسب وکار",{"$f":"CONCATENATE('C'!O145,CHAR(10),'C'!P145)","v":"\n"},{"$f":"CONCATENATE('C'!Q145,CHAR(10),'C'!R145)","v":"\n"},{"$f":"CONCATENATE(AH112,CHAR(10),AI112)","v":"\n-"},null,null,null,null,null,null,null,null,"10:30-12",null,null,"شنبه","دوشنبه",null,"13-14:30","13-14:30",null,"","-","رشته: مدیریت تکنولوزی- گرایش:  - كارشناسي ارشد - دانشجویان ترم 03 - روزانه و پردیس"]
[{"$f":"ROWS(A$2:C113)","v":112},"كارشناسي ارشد","مديريت فناوري اطلاعات","كسب و كار الكترونيك","آموزش الکترونیکی","مبانی زیر ساخت های فناوری اطلاعات","2",null,"فتحیان",3991,"ترم 01",3991,"مدیریت و فلسفه علم و فناوری",null,null,null,null,null,null,null,null,null,null,null,null,null,null,{"$f":"'C'!O113","v":0},{"$f":"'C'!P113","v":0},null,{"$f":"'C'!Q113","v":0},{"$f":"'C'!R113","v":0},null,"","-","رشته: مديريت فناوري اطلاعات- گرایش: كسب و كار الكترونيك - كارشناسي ارشد - دانشجویان ترم 01 - آموزش الکترونیکی"]
[{"$f":"ROWS(A$2:C114)","v":113},"كارشناسي ارشد","مديريت فناوري اطلاعات","كسب و كار الكترونيك","آموزش الکترونیکی","مبانی مدیریت دانش","2",null,"اخوان",3991,"ترم 01",3991,"مدیریت و فلسفه علم و فناوری",null,null,null,null,null,null,null,null,null,null,null,null,null,null,{"$f":"'C'!O114","v":0},{"$f":"'C'!P114","v":0},null,{"$f":"'C'!Q114","v":0},{"$f":"'C'!R114","v":0},null,"","-","رشته: مديريت فناوري اطلاعات- گرایش: كسب و كار الكترونيك - كارشناسي ارشد - دانشجویان ترم 01 - آموزش الکترونیکی"]
[{"$f":"ROWS(A$2:C115)","v":114},"كارشناسي ارشد","مدیریت تکنولوزی",null,"روزانه و پردیس","سیستم های اطلاعات مدیریت تکنولوژی",2,null,"خانی زاد","3991","ترم 03","3981","مدیریت و مهندسی کسب وکار",{"$f":"CONCATENATE('C'!O147,CHAR(10),'C'!P147)","v":"\n"},{"$f":"CONCATENATE('C'!Q147,CHAR(10),'C'!R147)","v":"\n"},{"$f":"CONCATENATE(AH115,CHAR(10),AI115)","v":"\n-"},null,null,null,null,null,null,null,null,"14:30-16",null,null,{"$f":"'C'!O115","v":0},{"$f":"'C'!P115","v":0},null,{"$f":"'C'!Q115","v":0},{"$f":"'C'!R115","v":0},null,"","-","رشته: مدیریت تکنولوزی- گرایش:  - كارشناسي ارشد - دانشجویان ترم 03 - روزانه و پردیس"]
[{"$f":"ROWS(A$2:C116)","v":115},"كارشناسي ارشد","مدیریت تکنولوزی",null,"روزانه و پردیس","سیستم های اطلاعاتی مدیریت تکنولوژی",2,null,"خانی زاد","3991","ترم 01","3991","مدیریت و مهندسی کسب وکار",{"$f":"CONCATENATE('C'!O158,CHAR(10),'C'!P158)","v":"\n"},{"$f":"CONCATENATE('C'!Q158,CHAR(10),'C'!R158)","v":"\n"},"\n-",null,null,null,null,null,null,null,null,"13-14:30",null,null,"چهارشنبه",null,null,"13-15",null,null,"","-","رشته: مدیریت تکنولوزی- گرایش:  - كارشناسي ارشد - دانشجویان ترم 01 - روزانه و پردیس"]
[{"$f":"ROWS(A$2:C117)","v":116},"كارشناسي ارشد","مديريت فناوري اطلاعات","كسب و كار الكترونيك","روزانه و پردیس","تجارت و کسب و کار الکترونیکی",2,null,"خانی زاد",3991,"ترم 03",3981,"مدیریت و فلسفه علم و فناوری",{"$f":"CONCATENATE('C'!O95,CHAR(10),'C'!P95)","v":"\n"},{"$f":"CONCATENATE('C'!Q95,CHAR(10),'C'!R95)","v":"\n"},"\n-",null,null,null,null,null,null,null,null,"7:30-9",null,null,"شنبه",null,null,"10-12",null,null,"","-","رشته: مديريت فناوري اطلاعات- گرایش: كسب و كار الكترونيك - كارشناسي ارشد - دانشجویان ترم 03 - روزانه و پردیس"]
[{"$f":"ROWS(A$2:C118)","v":117},"كارشناسي ارشد","مديريت فناوري اطلاعات","كسب و كار الكترونيك","روزانه و پردیس","سيستمهاي مدیریت بانکهای اطلاعاتی",{"$f":"VLOOKUP(F118,[2]Sheet1!$M:$N,2,FALSE)","v":{"$error":"#N/A"}},null,"خانی زاد",3991,"ترم 01",3991,"مدیریت و فلسفه علم و فناوری",{"$f":"CONCATENATE('C'!O99,CHAR(10),'C'!P99)","v":"\n"},{"$f":"CONCATENATE('C'!Q99,CHAR(10),'C'!R99)","v":"\n"},"\n-",null,null,null,null,null,null,"8-10",null,null,null,null,"شنبه","دوشنبه",null,"9-10","10:30-11:30",null,"","-","رشته: مديريت فناوري اطلاعات- گرایش: كسب و كار الكترونيك - كارشناسي ارشد - دانشجویان ترم 01 - روزانه و پردیس"]
[{"$f":"ROWS(A$2:C119)","v":118},"كارشناسي ارشد","مدیریت تکنولوزی",null,"روزانه و پردیس","اصول و مبانی مدیریت تکنولوژِی",2,null,"ذاکری","3991","ترم 01","3991","مدیریت و مهندسی کسب وکار",{"$f":"CONCATENATE('C'!O154,CHAR(10),'C'!P154)","v":"\n"},{"$f":"CONCATENATE('C'!Q154,CHAR(10),'C'!R154)","v":"\n"},"\n-",null,null,null,null,null,null,null,null,"10-12",null,null,{"$f":"'C'!O130","v":0},{"$f":"'C'!P130","v":0},null,{"$f":"'C'!Q130","v":0},{"$f":"'C'!R130","v":0},null,"","-","رشته: مدیریت تکنولوزی- گرایش:  - كارشناسي ارشد - دانشجویان ترم 01 - روزانه و پردیس"]
[{"$f":"ROWS(A$2:C120)","v":119},"كارشناسي ارشد","مدیریت تکنولوزی",null,"روزانه و پردیس","تئوری های نوآوری، مدلها و فرایندها",2,null,"ذاکری","3991","ترم 03","3981","مدیریت و مهندسی کسب وکار",{"$f":"CONCATENATE('C'!O146,CHAR(10),'C'!P146)","v":"\n"},{"$f":"CONCATENATE('C'!Q146,CHAR(10),'C'!R146)","v":"\n"},"\n-",null,null,null,null,null,null,null,null,"7:30-9",null,null,"چهارشنبه",{"$f":"'C'!P97","v":0},null,"10-12",{"$f":"'C'!R97","v":0},null,"","-","رشته: مدیریت تکنولوزی- گرایش:  - كارشناسي ارشد - دانشجویان ترم 03 - روزانه و پردیس"]
[{"$f":"ROWS(A$2:C121)","v":120},"كارشناسي ارشد","مدیریت کسب و کار",null,"روزانه و پردیس","مدیریت دانش",3,null,"ذاکری","3991","ترم 03","3981","مدیریت و مهندسی کسب وکار",{"$f":"CONCATENATE('C'!O185,CHAR(10),'C'!P185)","v":"\n"},{"$f":"CONCATENATE('C'!Q185,CHAR(10),'C'!R185)","v":"\n"},"\n-",null,null,null,null,null,"16-17",null,"16-17",null,null,null,"شنبه",null,null,null,"9-12",null,"","-","رشته: مدیریت کسب و کار- گرایش:  - كارشناسي ارشد - دانشجویان ترم 03 - روزانه و پردیس"]
[null,"كارشناسي ارشد","مديريت فناوري اطلاعات","كسب و كار الكترونيك","روزانه و پردیس","مبانی مدیریت دانش",2,null,"ذاکری",3991,"ترم 01",3991,"مدیریت و فلسفه علم و فناوری",null,null,null,null,null,null,null,null,null,null,null,"13-15",null,null,"دوشنبه","چهارشنبه",null,"10:30-12","10:30-12"]
[{"$f":"ROWS(A$2:C123)","v":122},"كارشناسي ارشد","علوم اقتصادی","توسعه اقتصادي و برنامه ريزي","روزانه","اقتصاد توسعه",3,null,"رضا محسنی",3991,"ترم 01",3991,"مهندسی پیشرفت اقتصادی",{"$f":"CONCATENATE('C'!O130,CHAR(10),'C'!P130)","v":"\n"},{"$f":"CONCATENATE('C'!Q130,CHAR(10),'C'!R130)","v":"\n"},{"$f":"CONCATENATE(AH123,CHAR(10),AI123)","v":"\n-"},null,null,null,null,null,null,"07:30-10","10:30-12",null,null,null,{"$f":"'C'!O126","v":0},{"$f":"'C'!P126","v":0},null,{"$f":"'C'!Q126","v":0},{"$f":"'C'!R126","v":0},null,"","-",{"$f":"CONCATENATE(\"رشته: \",C123,\"-\",\" گرایش: \",D123,\" - \",B123,\" - دانشجویان \",K123,\" - \",E123)","v":"رشته: علوم اقتصادی- گرایش: توسعه اقتصادي و برنامه ريزي - كارشناسي ارشد - دانشجویان ترم 01 - روزانه"}]
[{"$f":"ROWS(A$2:C124)","v":123},"كارشناسي ارشد","علوم اقتصادی","اقتصاد اسلامی","روزانه","اقتصاد ایران",3,null,"رضایی",3991,"ترم 01",3991,"مهندسی پیشرفت اقتصادی",{"$f":"CONCATENATE('C'!O119,CHAR(10),'C'!P119)","v":"\n"},{"$f":"CONCATENATE('C'!Q119,CHAR(10),'C'!R119)","v":"\n"},"\n-",null,null,null,null,null,null,null,"7:30-10:30",null,null,null,"دوشنبه",{"$f":"'C'!P127","v":0},null,"9-10:30",{"$f":"'C'!R127","v":0},null,"","-","رشته: علوم اقتصادی- گرایش: اقتصاد اسلامی - كارشناسي ارشد - دانشجویان ترم 01 - روزانه"]
[{"$f":"ROWS(A$2:C125)","v":124},"كارشناسي ارشد","علوم اقتصادی","توسعه اقتصادي و برنامه ريزي","روزانه","اقتصاد ایران","3",null,"رضایی",3991,"ترم 01",3991,"مهندسی پیشرفت اقتصادی",{"$f":"CONCATENATE('C'!O129,CHAR(10),'C'!P129)","v":"\n"},{"$f":"CONCATENATE('C'!Q129,CHAR(10),'C'!R129)","v":"\n"},"\n-",null,null,null,null,null,null,null,"7:30-10:30",null,null,null,{"$f":"'C'!O128","v":0},{"$f":"'C'!P128","v":0},null,{"$f":"'C'!Q128","v":0},{"$f":"'C'!R128","v":0},null,"","-","رشته: علوم اقتصادی- گرایش: توسعه اقتصادي و برنامه ريزي - كارشناسي ارشد - دانشجویان ترم 01 - روزانه"]
[{"$f":"ROWS(A$2:C126)","v":125},"كارشناسي ارشد","مديريت فناوري اطلاعات","كسب و كار الكترونيك","روزانه و پردیس","بازاریابی الکترونیکی",2,null,"رضایی",3991,"ترم 03",3981,"مدیریت و فلسفه علم و فناوری",{"$f":"CONCATENATE('C'!O94,CHAR(10),'C'!P94)","v":"\n"},{"$f":"CONCATENATE('C'!Q94,CHAR(10),'C'!R94)","v":"\n"},"\n-",null,null,null,null,null,null,"8-9:30",null,null,null,null,{"$f":"'C'!O130","v":0},{"$f":"'C'!P130","v":0},null,{"$f":"'C'!Q130","v":0},{"$f":"'C'!R130","v":0},null,"","-","رشته: مديريت فناوري اطلاعات- گرایش: كسب و كار الكترونيك - كارشناسي ارشد - دانشجویان ترم 03 - روزانه و پردیس"]
[{"$f":"ROWS(A$2:C127)","v":126},"كارشناسي ارشد","علوم اقتصادی","اقتصاد اسلامی","روزانه","اقتصاد اسلامی 1",3,null,"رفیعی",3991,"ترم 01",3991,"مهندسی پیشرفت اقتصادی",{"$f":"CONCATENATE('C'!O118,CHAR(10),'C'!P118)","v":"\n"},{"$f":"CONCATENATE('C'!Q118,CHAR(10),'C'!R118)","v":"\n"},"\n-",null,null,null,null,"9-10:30",null,null,null,"15:30-17",null,null,{"$f":"'C'!O96","v":0},{"$f":"'C'!P96","v":0},null,{"$f":"'C'!Q96","v":0},{"$f":"'C'!R96","v":0},null,"","-","رشته: علوم اقتصادی- گرایش: اقتصاد اسلامی - كارشناسي ارشد - دانشجویان ترم 01 - روزانه"]
[{"$f":"ROWS(A$2:C128)","v":127},"كارشناسي ارشد","علوم اقتصادی","توسعه اقتصادي و برنامه ريزي","روزانه","اقتصاد خرد",4,null,"رفیعی",3991,"ترم 01",3991,"مهندسی پیشرفت اقتصادی",{"$f":"CONCATENATE('C'!O128,CHAR(10),'C'!P128)","v":"\n"},{"$f":"CONCATENATE('C'!Q128,CHAR(10),'C'!R128)","v":"\n"},"\n-",null,null,null,null,"7:30-9",null,"7:30-9",null,"7:30-9",null,null,{"$f":"'C'!O123","v":0},{"$f":"'C'!P123","v":0},null,{"$f":"'C'!Q123","v":0},{"$f":"'C'!R123","v":0},null,"","-","رشته: علوم اقتصادی- گرایش: توسعه اقتصادي و برنامه ريزي - كارشناسي ارشد - دانشجویان ترم 01 - روزانه"]
[{"$f":"ROWS(A$2:C129)","v":128},"كارشناسي ارشد","علوم اقتصادی","برنامه ريزي سيستمهاي اقتصادي","روزانه","اقتصاد خرد",4,null,"رفیعی",3991,"ترم 03",3981,"مهندسی پیشرفت اقتصادی",{"$f":"CONCATENATE('C'!O122,CHAR(10),'C'!P122)","v":"\n"},{"$f":"CONCATENATE('C'!Q122,CHAR(10),'C'!R122)","v":"\n"},"\n-",null,null,null,null,"07:30-9",null,"0730-9",null,"10:30-12",null,null,"شنبه",{"$f":"'C'!P132","v":0},null,"7:30-9:30",{"$f":"'C'!R132","v":0},null,"","-","رشته: علوم اقتصادی- گرایش: برنامه ريزي سيستمهاي اقتصادي - كارشناسي ارشد - دانشجویان ترم 03 - روزانه"]
[null,"دكتري تخصصي","سياست گذاري علم و فناوري","-","روزانه و پردیس","فلسفه علم و فناوری","2",null,"رفیعی آتانی","3991","ترم 01","3991","مدیریت و فلسفه علم و فناوری",{"$f":"CONCATENATE('C'!O119,CHAR(10),'C'!P119)","v":"\n"},{"$f":"CONCATENATE('C'!Q119,CHAR(10),'C'!R119)","v":"\n"},"\n-",null,null,null,null,"17-18:30",null,"9-10:30",null,null,null,null,"شنبه",{"$f":"'C'!P134","v":0},null,"13-15",{"$f":"'C'!R134","v":0},null,"","-","رشته: سياست گذاري علم و فناوري- گرایش: - - دكتري تخصصي - دانشجویان ترم 01 - روزانه و پردیس"]
[{"$f":"ROWS(A$2:C131)","v":130},"كارشناسي ارشد","مدیریت تکنولوزی",null,"روزانه و پردیس","تصمیم گیری و تحقیق در عملیات",2,null,"سبحانی","3991","ترم 01","3991","مدیریت و مهندسی کسب وکار",{"$f":"CONCATENATE('C'!O155,CHAR(10),'C'!P155)","v":"\n"},{"$f":"CONCATENATE('C'!Q155,CHAR(10),'C'!R155)","v":"\n"},"\n-",null,null,null,null,null,null,"10-12",null,null,null,null,"چهارشنبه","یکشنبه",null,"14:30-16","17-18:30",null,"","-","رشته: مدیریت تکنولوزی- گرایش:  - كارشناسي ارشد - دانشجویان ترم 01 - روزانه و پردیس"]
[]
[{"$f":"ROWS(A$2:C133)","v":132},"كارشناسي ارشد","مدیریت کسب و کار",null,"روزانه و پردیس","مدیریت منابع انسانی",3,null,"سبحانی","3991","ترم 03","3981","مدیریت و مهندسی کسب وکار",{"$f":"CONCATENATE('C'!O183,CHAR(10),'C'!P183)","v":"\n"},{"$f":"CONCATENATE('C'!Q183,CHAR(10),'C'!R183)","v":"\n"},{"$f":"CONCATENATE(AH133,CHAR(10),AI133)","v":"\n-"},null,null,null,null,null,"13-14",null,"13-14",null,null,null,"دوشنبه",{"$f":"'C'!P136","v":0},null,"7:30-9",{"$f":"'C'!R136","v":0},null,"","-","رشته: مدیریت کسب و کار- گرایش:  - كارشناسي ارشد - دانشجویان ترم 03 - روزانه و پردیس"]
[null,"كارشناسي ارشد","كارآفريني","كسب و كار جديد","روزانه و پردیس","بازایابی و تحقیقات بازار",2,"پارسانژاد","حمیدی زاده",3981,"ترم 03",3981,null,null,null,null,null,null,null,null,null,"15-16:30"]
[null,"كارشناسي ارشد","مديريت فناوري اطلاعات","كسب و كار الكترونيك","روزانه و پردیس","آمار تحلیلی",2,null,"سبحانی",3991,"ترم 03",3981,"مدیریت و فلسفه علم و فناوری",null,null,null,null,null,null,null,null,null,null,null,"13-14:30",null,null,{"$f":"'C'!O138","v":0},{"$f":"'C'!P138","v":0},null,{"$f":"'C'!Q138","v":0},{"$f":"'C'!R138","v":0},null,"","-","رشته: مديريت فناوري اطلاعات- گرایش: كسب و كار الكترونيك - كارشناسي ارشد - دانشجویان ترم 03 - روزانه و پردیس"]
[{"$f":"ROWS(A$2:C136)","v":135},"كارشناسي ارشد","كارآفريني","كسب و كار جديد","روزانه و پردیس","مدیریت مالی(جبرانی)",2,null,"سجادی","3991","ترم 01","3991","مدیریت و فلسفه علم و فناوری",{"$f":"CONCATENATE('C'!O127,CHAR(10),'C'!P127)","v":"\n"},{"$f":"CONCATENATE('C'!Q127,CHAR(10),'C'!R127)","v":"\n"},{"$f":"CONCATENATE(AH136,CHAR(10),AI136)","v":"\n-"},null,null,null,null,null,null,null,null,null,"9:30-11:30",null,"چهارشنبه",{"$f":"'C'!P139","v":0},null,"10-12",{"$f":"'C'!R139","v":0},null,"","-","رشته: كارآفريني- گرایش: كسب و كار جديد - كارشناسي ارشد - دانشجویان ترم 01 - روزانه و پردیس"]
[{"$f":"ROWS(A$2:C137)","v":136},"كارشناسي ارشد","مديريت فناوري اطلاعات","كسب و كار الكترونيك","مجازی","مباني تئوري و فلسفي سيستمهاي اطلاعاتي",{"$f":"VLOOKUP(F137,[2]Sheet1!$M:$N,2,FALSE)","v":2},null,"رفیعی آتانی",3991,"ترم 01",3991,"مدیریت و فلسفه علم و فناوری",{"$f":"CONCATENATE('C'!O100,CHAR(10),'C'!P100)","v":"\n"},{"$f":"CONCATENATE('C'!Q100,CHAR(10),'C'!R100)","v":"\n"},"\n-",null,null,null,null,null,null,null,null,null,null,null,{"$f":"'C'!O140","v":0},{"$f":"'C'!P140","v":0},null,{"$f":"'C'!Q140","v":0},{"$f":"'C'!R140","v":0},null,"","-","رشته: مديريت فناوري اطلاعات- گرایش: كسب و كار الكترونيك - كارشناسي ارشد - دانشجویان ترم 01 - مجازی"]
[{"$f":"ROWS(A$2:C138)","v":137},"كارشناسي ارشد","مدیریت کسب و کار",null,"روزانه و پردیس","حسابداری برای مدیران",3,null,"سجادی","3991","ترم 03","3981","مدیریت و مهندسی کسب وکار",{"$f":"CONCATENATE('C'!O182,CHAR(10),'C'!P182)","v":"\n"},{"$f":"CONCATENATE('C'!Q182,CHAR(10),'C'!R182)","v":"\n"},"\n-",null,null,null,null,null,null,null,null,null,"7:30-9:30",null,"دوشنبه",{"$f":"'C'!P143","v":0},null,"10-12",{"$f":"'C'!R143","v":0},null,"","-","رشته: مدیریت کسب و کار- گرایش:  - كارشناسي ارشد - دانشجویان ترم 03 - روزانه و پردیس"]
[{"$f":"ROWS(A$2:C139)","v":138},"كارشناسي ارشد","مديريت فناوري اطلاعات","كسب و كار الكترونيك","روزانه و پردیس","مدیریت پروژه های فناوری اطلاعات",2,null,"سلامت",3991,"ترم 03",3981,"مدیریت و فلسفه علم و فناوری",{"$f":"CONCATENATE('C'!O97,CHAR(10),'C'!P97)","v":"\n"},{"$f":"CONCATENATE('C'!Q97,CHAR(10),'C'!R97)","v":"\n"},"\n",null,null,null,null,null,null,"15-16:30"]
[{"$f":"ROWS(A$2:C140)","v":139},"كارشناسي ارشد","مدیریت کسب و کار",null,"روزانه و پردیس","مدیریت عملیات",3,null,"سیدحسینی","3991","ترم 01","3991","مدیریت و مهندسی کسب وکار",{"$f":"CONCATENATE('C'!O196,CHAR(10),'C'!P196)","v":"\n"},{"$f":"CONCATENATE('C'!Q196,CHAR(10),'C'!R196)","v":"\n"},"\n",null,null,null,null,null,"7:30-9",null,"7:30-9"]
[null,"دكتري تخصصي","سياست گذاري علم و فناوري","-","روزانه و پردیس","مطالعات گروهی","0",null,"شفیعا-عبدالحمید- علی احمدی-رفیعی-معینی-شوال پور","3991","ترم 01","3991","مدیریت و فلسفه علم و فناوری",{"$f":"CONCATENATE('C'!O123,CHAR(10),'C'!P123)","v":"\n"},{"$f":"CONCATENATE('C'!Q123,CHAR(10),'C'!R123)","v":"\n"},"\n-",null,null,null,null,null,null,"7:30-9",null,null,null,null,"چهارشنبه",{"$f":"'C'!P148","v":0},null,"7:30-9",{"$f":"'C'!R148","v":0},null,"","-","رشته: سياست گذاري علم و فناوري- گرایش: - - دكتري تخصصي - دانشجویان ترم 01 - روزانه و پردیس"]
[{"$f":"ROWS(A$2:C142)","v":141},"كارشناسي ارشد","علوم اقتصادی","برنامه ريزي سيستمهاي اقتصادي","روزانه","اقتصاد سنجی-اصلی","3",null,"شوال پور",3991,"ترم 03",3981,"مهندسی پیشرفت اقتصادی",{"$f":"CONCATENATE('C'!O123,CHAR(10),'C'!P123)","v":"\n"},{"$f":"CONCATENATE('C'!Q123,CHAR(10),'C'!R123)","v":"\n"},"\n",null,null,null,null,"15-17",null,null,null,null,null,null,"دوشنبه",null,null,"8-10"]
[{"$f":"ROWS(A$2:C143)","v":142},"كارشناسي ارشد","علوم اقتصادی","توسعه اقتصادي و برنامه ريزي","روزانه","اقتصاد سنجی",3,null,"شوال پور",3991,"ترم 03",3981,"مهندسی پیشرفت اقتصادی",null,null,null,null,null,null,null,"9-10",null,"10:30-11:30",null,null,null,null,{"$f":"'C'!O150","v":0},{"$f":"'C'!P150","v":0},null,{"$f":"'C'!Q150","v":0},{"$f":"'C'!R150","v":0},null,"","-",{"$f":"CONCATENATE(\"رشته: \",C143,\"-\",\" گرایش: \",D143,\" - \",B143,\" - دانشجویان \",K143,\" - \",E143)","v":"رشته: علوم اقتصادی- گرایش: توسعه اقتصادي و برنامه ريزي - كارشناسي ارشد - دانشجویان ترم 03 - روزانه"}]
[{"$f":"ROWS(A$2:C144)","v":143},"كارشناسي ارشد","مدیریت تکنولوزی",null,"روزانه و پردیس","تئوری های اقتصادی و سیر تحول تکنولوژی",2,null,"شوال پور","3991","ترم 01","3991","مدیریت و مهندسی کسب وکار",{"$f":"CONCATENATE('C'!O157,CHAR(10),'C'!P157)","v":"\n"},{"$f":"CONCATENATE('C'!Q157,CHAR(10),'C'!R157)","v":"\n"},{"$f":"CONCATENATE(AH144,CHAR(10),AI144)","v":"\n-"},null,null,null,null,null,null,"8-10",null,null,null,null,"دوشنبه","سه شنبه",null,"9-10:30","16:30-18",null,"","-","رشته: مدیریت تکنولوزی- گرایش:  - كارشناسي ارشد - دانشجویان ترم 01 - روزانه و پردیس"]
[{"$f":"ROWS(A$2:C145)","v":144},"دکتری","مدیریت تکنولوزی",null,"روزانه و پردیس","سیر تغییرات تکنولوژی",2,null,"شوال پور","3991","ترم 01","3991","مدیریت و مهندسی کسب وکار",{"$f":"CONCATENATE('C'!O141,CHAR(10),'C'!P141)","v":"\n"},{"$f":"CONCATENATE('C'!Q141,CHAR(10),'C'!R141)","v":"\n"},"\n-",null,null,null,null,null,null,null,null,"13-15",null,null,{"$f":"'C'!O152","v":0},{"$f":"'C'!P152","v":0},null,{"$f":"'C'!Q152","v":0},{"$f":"'C'!R152","v":0},null,"","-","رشته: مدیریت تکنولوزی- گرایش:  - دکتری - دانشجویان ترم 01 - روزانه و پردیس"]
[null,"دكتري تخصصي","سياست گذاري علم و فناوري","-","روزانه و پردیس","نهادهای موثر در توسعه علم و فناوری","2",null,"صالحی","3991","ترم 01","3991","مدیریت و فلسفه علم و فناوری",{"$f":"CONCATENATE('C'!O122,CHAR(10),'C'!P122)","v":"\n"},{"$f":"CONCATENATE('C'!Q122,CHAR(10),'C'!R122)","v":"\n"},"\n-",null,null,null,null,"15-17",null,null,null,null,null,null,"دوشنبه",{"$f":"'C'!P153","v":0},null,"15-17",{"$f":"'C'!R153","v":0},null,"","-","رشته: سياست گذاري علم و فناوري- گرایش: - - دكتري تخصصي - دانشجویان ترم 01 - روزانه و پردیس"]
[{"$f":"ROWS(A$2:C147)","v":146},"كارشناسي ارشد","كارآفريني","كسب و كار جديد","روزانه و پردیس","استقرار کسب و کار",2,null,"صالحی","3991","ترم 03",3981,"مدیریت و فلسفه علم و فناوری",{"$f":"CONCATENATE('C'!O134,CHAR(10),'C'!P134)","v":"\n"},{"$f":"CONCATENATE('C'!Q134,CHAR(10),'C'!R134)","v":"\n"},"\n-",null,null,null,null,null,null,"8:30-10",null,null,null,null,"چهارشنبه",{"$f":"'C'!P154","v":0},null,"13-15",{"$f":"'C'!R154","v":0},null,"","-","رشته: كارآفريني- گرایش: كسب و كار جديد - كارشناسي ارشد - دانشجویان ترم 03 - روزانه و پردیس"]
[{"$f":"ROWS(A$2:C148)","v":147},"كارشناسي ارشد","كارآفريني","كسب و كار جديد","روزانه و پردیس","طراحی و تدوین کسب وکار(اصلی)",2,null,"صالحی","3991","ترم 01","3991","مدیریت و فلسفه علم و فناوری",{"$f":"CONCATENATE('C'!O126,CHAR(10),'C'!P126)","v":"\n"},{"$f":"CONCATENATE('C'!Q126,CHAR(10),'C'!R126)","v":"\n"},"\n-",null,null,null,null,"13-15",null,null,null,null,null,null,"چهارشنبه",{"$f":"'C'!P155","v":0},null,"14:30-16",{"$f":"'C'!R155","v":0},null,"","-","رشته: كارآفريني- گرایش: كسب و كار جديد - كارشناسي ارشد - دانشجویان ترم 01 - روزانه و پردیس"]
[{"$f":"ROWS(A$2:C149)","v":148},"كارشناسي ارشد","مديريت فناوري اطلاعات","كسب و كار الكترونيك","روزانه و پردیس","کارآفرینی و نوآوری دیجیتال",2,null,"صالحی",3991,"ترم 01",3991,"مدیریت و فلسفه علم و فناوری",{"$f":"CONCATENATE('C'!O114,CHAR(10),'C'!P114)","v":"\n"},{"$f":"CONCATENATE('C'!Q114,CHAR(10),'C'!R114)","v":"\n"},"\n-",null,null,null,null,null,null,"10-12",null,null,null,null,"چهارشنبه",{"$f":"'C'!P156","v":0},null,"8-10",{"$f":"'C'!R156","v":0},null,"","-","رشته: مديريت فناوري اطلاعات- گرایش: كسب و كار الكترونيك - كارشناسي ارشد - دانشجویان ترم 01 - روزانه و پردیس"]
[null,"دكتري تخصصي","سياست گذاري علم و فناوري","-","روزانه و پردیس","روش تحقیق در سیاستگذاری علم و فناوری","2",null,"عبدالحمید","3991","ترم 01","3991","مدیریت و فلسفه علم و فناوری",{"$f":"CONCATENATE('C'!O120,CHAR(10),'C'!P120)","v":"\n"},{"$f":"CONCATENATE('C'!Q120,CHAR(10),'C'!R120)","v":"\n"},"\n-",null,null,null,null,"13-15",null,null,null,null,null,null,"چهارشنبه",{"$f":"'C'!P157","v":0},null,"10-12",{"$f":"'C'!R157","v":0},null,"","-","رشته: سياست گذاري علم و فناوري- گرایش: - - دكتري تخصصي - دانشجویان ترم 01 - روزانه و پردیس"]
[{"$f":"ROWS(A$2:C151)","v":150},"كارشناسي ارشد","علوم اقتصادی","توسعه اقتصادي و برنامه ريزي","روزانه","روش تحقیق","0",null,"عبدالحمید",3991,"ترم 01",3991,"مهندسی پیشرفت اقتصادی",{"$f":"CONCATENATE('C'!O131,CHAR(10),'C'!P131)","v":"\n"},{"$f":"CONCATENATE('C'!Q131,CHAR(10),'C'!R131)","v":"\n"},"\n-",null,null,null,null,null,null,null,null,"10-12",null,null,"چهارشنبه",{"$f":"'C'!P158","v":0},null,"15-17",{"$f":"'C'!R158","v":0},null,"","-","رشته: علوم اقتصادی- گرایش: توسعه اقتصادي و برنامه ريزي - كارشناسي ارشد - دانشجویان ترم 01 - روزانه"]
[{"$f":"ROWS(A$2:C152)","v":151},"كارشناسي ارشد","مدیریت کسب و کار",null,"روزانه و پردیس","نظریه های سازمان و مدیریت",3,null,"عبدالحمید","3991","ترم 01","3991","مدیریت و مهندسی کسب وکار",{"$f":"CONCATENATE('C'!O197,CHAR(10),'C'!P197)","v":"\n"},{"$f":"CONCATENATE('C'!Q197,CHAR(10),'C'!R197)","v":"\n"},"\n-",null,null,null,null,null,"10:30-12",null,"10:30-12",null,null,null,"چهارشنبه","یکشنبه",null,"14:30-16","17-18:30",null,"","-","رشته: مدیریت کسب و کار- گرایش:  - كارشناسي ارشد - دانشجویان ترم 01 - روزانه و پردیس"]
[{"$f":"ROWS(A$2:C153)","v":152},"كارشناسي ارشد","مديريت فناوري اطلاعات","كسب و كار الكترونيك","روزانه و پردیس","روش تحقیق",2,null,"عبدالحمید",3991,"ترم 01",3991,"مدیریت و فلسفه علم و فناوری",{"$f":"CONCATENATE('C'!O110,CHAR(10),'C'!P110)","v":"\n"},{"$f":"CONCATENATE('C'!Q110,CHAR(10),'C'!R110)","v":"\n"},"\n-",null,null,null,null,null,null,null,null,"10-12",null,null,"دوشنبه","سه شنبه",null,"10:30-12","16:30-18",null,"","-","رشته: مديريت فناوري اطلاعات- گرایش: كسب و كار الكترونيك - كارشناسي ارشد - دانشجویان ترم 01 - روزانه و پردیس"]
[null,"دكتري تخصصي","سياست گذاري علم و فناوري","-","روزانه و پردیس","مدیریت استراتژیک علم و فناوری","2",null,"علی احمدی","3991","ترم 01","3991","مدیریت و فلسفه علم و فناوری",{"$f":"CONCATENATE('C'!O121,CHAR(10),'C'!P121)","v":"\n"},{"$f":"CONCATENATE('C'!Q121,CHAR(10),'C'!R121)","v":"\n"},"\n-",null,null,null,null,"8-10",null,null,null,null,null,null,{"$f":"'C'!O163","v":0},{"$f":"'C'!P163","v":0},null,{"$f":"'C'!Q163","v":0},{"$f":"'C'!R163","v":0},null,"","-","رشته: سياست گذاري علم و فناوري- گرایش: - - دكتري تخصصي - دانشجویان ترم 01 - روزانه و پردیس"]
[{"$f":"ROWS(A$2:C155)","v":154},"كارشناسي ارشد","مدیریت کسب و کار","استراتژی","روزانه و پردیس","مدیریت استراتژیک پیشرفته",3,null,"علی احمدی","3991","ترم 03","3981","مدیریت و مهندسی کسب وکار",{"$f":"CONCATENATE('C'!O186,CHAR(10),'C'!P186)","v":"\n"},{"$f":"CONCATENATE('C'!Q186,CHAR(10),'C'!R186)","v":"\n"},"\n-",null,null,null,null,null,"17-18",null,"17-18",null,null,null,{"$f":"'C'!O166","v":0},{"$f":"'C'!P166","v":0},null,{"$f":"'C'!Q166","v":0},{"$f":"'C'!R166","v":0},null,"","-","رشته: مدیریت کسب و کار- گرایش: استراتژی - كارشناسي ارشد - دانشجویان ترم 03 - روزانه و پردیس"]
[{"$f":"ROWS(A$2:C156)","v":155},"كارشناسي ارشد","كارآفريني","كسب و كار جديد","روزانه و پردیس","تحلیل محیط کسب و کار (اصلی)",2,null,"علیها","3991","ترم 01","3991","مدیریت و فلسفه علم و فناوری",{"$f":"CONCATENATE('C'!O125,CHAR(10),'C'!P125)","v":"\n"},{"$f":"CONCATENATE('C'!Q125,CHAR(10),'C'!R125)","v":"\n"},"\n-",null,null,null,null,"15-17",null,null,null,null,null,null,"یکشنبه","سه شنبه","چهارشنبه","15-16","15-16","17:30-18:30","","-","رشته: كارآفريني- گرایش: كسب و كار جديد - كارشناسي ارشد - دانشجویان ترم 01 - روزانه و پردیس"]
[{"$f":"ROWS(A$2:C157)","v":156},"كارشناسي ارشد","كارآفريني","كسب و كار جديد","روزانه و پردیس","توسعه محصول جدید","2",null,"علیها","3991","ترم 03",3981,"مدیریت و فلسفه علم و فناوری",{"$f":"CONCATENATE('C'!O136,CHAR(10),'C'!P136)","v":"\n"},{"$f":"CONCATENATE('C'!Q136,CHAR(10),'C'!R136)","v":"\n"},"\n-",null,null,null,null,null,null,null,null,"16-17:30",null,null,"یکشنبه","سه شنبه",null,"17-18","17-18",null,"","-","رشته: كارآفريني- گرایش: كسب و كار جديد - كارشناسي ارشد - دانشجویان ترم 03 - روزانه و پردیس"]
[{"$f":"ROWS(A$2:C158)","v":157},"كارشناسي ارشد","مديريت فناوري اطلاعات","كسب و كار الكترونيك","روزانه و پردیس","مبانی و زیر ساخت های فناوری اطلاعات",2,null,"فتحیان",3991,"ترم 01",3991,"مدیریت و فلسفه علم و فناوری",{"$f":"CONCATENATE('C'!O115,CHAR(10),'C'!P115)","v":"\n"},{"$f":"CONCATENATE('C'!Q115,CHAR(10),'C'!R115)","v":"\n"},"\n-",null,null,null,null,null,null,null,null,"15-17",null,null,"یکشنبه","سه شنبه",null,"9-10:30","9-10:30",null,"","-","رشته: مديريت فناوري اطلاعات- گرایش: كسب و كار الكترونيك - كارشناسي ارشد - دانشجویان ترم 01 - روزانه و پردیس"]
[null,"كارشناسي ارشد","مدیریت تکنولوزی","سیاستهای تحقیق و توسعه","روزانه و پردیس","ارتباط مراکز غلمی و صنعتی",2,null,"قادری فر",3991,"ترم 03","3981","مدیریت و مهندسی کسب وکار",null,null,null,null,null,null,null,null,null,null,null,"17-18:30",null,null,"یکشنبه","سه شنبه",null,"16-17","16-17",null,"","-","رشته: مدیریت تکنولوزی- گرایش: سیاستهای تحقیق و توسعه - كارشناسي ارشد - دانشجویان ترم 03 - روزانه و پردیس"]
[null,"دكتري تخصصي","سياست گذاري علم و فناوري","-","روزانه و پردیس","نظام نوآوری و توسعه فناوری","2",null,"قاضی نوری","3991","ترم 01","3991","مدیریت و فلسفه علم و فناوری",{"$f":"CONCATENATE('C'!O118,CHAR(10),'C'!P118)","v":"\n"},{"$f":"CONCATENATE('C'!Q118,CHAR(10),'C'!R118)","v":"\n"},{"$f":"CONCATENATE(AH160,CHAR(10),AI160)","v":"\n-"},null,null,null,null,"10:30-12",null,"13-14:30",null,null,null,null,"یکشنبه","سه شنبه",null,"7:30-9","7:30-9",null,"","-","رشته: سياست گذاري علم و فناوري- گرایش: - - دكتري تخصصي - دانشجویان ترم 01 - روزانه و پردیس"]
[{"$f":"ROWS(A$2:C161)","v":160},"كارشناسي ارشد","علوم اقتصادی","برنامه ريزي سيستمهاي اقتصادي","روزانه","تحلیل تصمیم گیری","3",null,"کرمانی",3991,"ترم 03",3981,"مهندسی پیشرفت اقتصادی",{"$f":"CONCATENATE('C'!O121,CHAR(10),'C'!P121)","v":"\n"},{"$f":"CONCATENATE('C'!Q121,CHAR(10),'C'!R121)","v":"\n"},"\n-",null,null,null,null,"8-10",null,null,null,null,null,null,"یکشنبه","سه شنبه",null,"16-17","16-17",null,"","-","رشته: علوم اقتصادی- گرایش: برنامه ريزي سيستمهاي اقتصادي - كارشناسي ارشد - دانشجویان ترم 03 - روزانه"]
[{"$f":"ROWS(A$2:C162)","v":161},"كارشناسي ارشد","علوم اقتصادی","توسعه اقتصادي و برنامه ريزي","روزانه","روش های کمی در اقتصاد",2,null,"کرمانی",3991,"ترم 01",3991,"مهندسی پیشرفت اقتصادی",{"$f":"CONCATENATE('C'!O132,CHAR(10),'C'!P132)","v":"\n"},{"$f":"CONCATENATE('C'!Q132,CHAR(10),'C'!R132)","v":"\n"},"\n-",null,null,null,null,null,null,"17-19",null,null,null,null,"یکشنبه","سه شنبه",null,"13-14","13-14",null,"","-","رشته: علوم اقتصادی- گرایش: توسعه اقتصادي و برنامه ريزي - كارشناسي ارشد - دانشجویان ترم 01 - روزانه"]
[{"$f":"ROWS(A$2:C163)","v":162},"كارشناسي ارشد","مديريت فناوري اطلاعات","كسب و كار الكترونيك","روزانه و پردیس","هوشمندی کسب و کار",2,null,"کرمانی",3991,"ترم 03",3981,"مدیریت و فلسفه علم و فناوری",{"$f":"CONCATENATE('C'!O98,CHAR(10),'C'!P98)","v":"\n"},{"$f":"CONCATENATE('C'!Q98,CHAR(10),'C'!R98)","v":"\n"},"\n-",null,null,null,null,null,null,null,null,"10:30-12",null,null,"یکشنبه","سه شنبه",null,"10:30-12","10:30-12",null,"","-","رشته: مديريت فناوري اطلاعات- گرایش: كسب و كار الكترونيك - كارشناسي ارشد - دانشجویان ترم 03 - روزانه و پردیس"]
[{"$f":"ROWS(A$2:C164)","v":163},"كارشناسي ارشد","مهندسي صنايع-سيستمهاي كلان","-","روزانه","سیستم های مدیریت فرآیند کسب و کار","3",null,"کرمانی",3991,"ترم 03",3981,"مهندسی پیشرفت اقتصادی",{"$f":"CONCATENATE('C'!O136,CHAR(10),'C'!P136)","v":"\n"},{"$f":"CONCATENATE('C'!Q136,CHAR(10),'C'!R136)","v":"\n"},"\n-",null,null,null,null,null,"9-10",null,"9-10",null,null,null,"چهارشنبه",{"$f":"'C'!P176","v":0},null,"13-14:30",{"$f":"'C'!R176","v":0},null,"","-","رشته: مهندسي صنايع-سيستمهاي كلان- گرایش: - - كارشناسي ارشد - دانشجویان ترم 03 - روزانه"]
[{"$f":"ROWS(A$2:C165)","v":164},"كارشناسي ارشد","مهندسي صنايع-سيستمهاي كلان","-","روزانه","روش تحقیق","1",null,"محمدی",3991,"ترم 03",3981,"مهندسی پیشرفت اقتصادی",{"$f":"CONCATENATE('C'!O134,CHAR(10),'C'!P134)","v":"\n"},{"$f":"CONCATENATE('C'!Q134,CHAR(10),'C'!R134)","v":"\n"},"\n-",null,null,null,null,null,null,null,"7:30-8:10",null,null,null,{"$f":"'C'!O177","v":0},{"$f":"'C'!P177","v":0},null,{"$f":"'C'!Q177","v":0},{"$f":"'C'!R177","v":0},null,"","-","رشته: مهندسي صنايع-سيستمهاي كلان- گرایش: - - كارشناسي ارشد - دانشجویان ترم 03 - روزانه"]
[{"$f":"ROWS(A$2:C166)","v":165},"كارشناسي ارشد","علوم اقتصادی","اقتصاد اسلامی","روزانه","نظام اقتصادی اسلام",2,null,"معینی",3991,"ترم 01",3991,"مهندسی پیشرفت اقتصادی",{"$f":"CONCATENATE('C'!O116,CHAR(10),'C'!P116)","v":"\n"},{"$f":"CONCATENATE('C'!Q116,CHAR(10),'C'!R116)","v":"\n"},"\n-",null,null,null,null,null,null,null,null,"13-15",null,null,{"$f":"'C'!O180","v":0},{"$f":"'C'!P180","v":0},null,{"$f":"'C'!Q180","v":0},{"$f":"'C'!R180","v":0},null,"","-","رشته: علوم اقتصادی- گرایش: اقتصاد اسلامی - كارشناسي ارشد - دانشجویان ترم 01 - روزانه"]
[{"$f":"ROWS(A$2:C167)","v":166},"كارشناسي ارشد","علوم اقتصادی","توسعه اقتصادي و برنامه ريزي","روزانه","موضوعات انتخابی در اقتصاد اسلام","3",null,"معینی",3991,"ترم 03",3981,"مهندسی پیشرفت اقتصادی",{"$f":"CONCATENATE('C'!O127,CHAR(10),'C'!P127)","v":"\n"},{"$f":"CONCATENATE('C'!Q127,CHAR(10),'C'!R127)","v":"\n"},"\n-",null,null,null,null,"10-12",null,null,null,null,null,null,{"$f":"'C'!O182","v":0},{"$f":"'C'!P182","v":0},null,{"$f":"'C'!Q182","v":0},{"$f":"'C'!R182","v":0},null,"","-","رشته: علوم اقتصادی- گرایش: توسعه اقتصادي و برنامه ريزي - كارشناسي ارشد - دانشجویان ترم 03 - روزانه"]
[{"$f":"ROWS(A$2:C168)","v":167},"دکتری","مدیریت تکنولوزی",null,"روزانه و پردیس","مدلهای انتقال تکنولوژی و مالکیت معنوی",2,null,"منطقی","3991","ترم 01","3991","مدیریت و مهندسی کسب وکار",{"$f":"CONCATENATE('C'!O142,CHAR(10),'C'!P142)","v":"\n"},{"$f":"CONCATENATE('C'!Q142,CHAR(10),'C'!R142)","v":"\n"},"\n-",null,null,null,null,null,null,null,null,"10-12",null,null,"چهارشنبه",{"$f":"'C'!P183","v":0},null,"7:30-9",{"$f":"'C'!R183","v":0},null,"","-","رشته: مدیریت تکنولوزی- گرایش:  - دکتری - دانشجویان ترم 01 - روزانه و پردیس"]
[{"$f":"ROWS(A$2:C169)","v":168},"دکتری","مدیریت تکنولوزی",null,"روزانه و پردیس","مبانی نظریه های اقتصاددانان کلاسیک و نئو کلاسیک",2,null,"میرزامحمدی","3991","ترم 01","3991","مدیریت و مهندسی کسب وکار",{"$f":"CONCATENATE('C'!O139,CHAR(10),'C'!P139)","v":"\n"},{"$f":"CONCATENATE('C'!Q139,CHAR(10),'C'!R139)","v":"\n"},"\n-",null,null,null,null,null,null,null,null,"15-17",null,null,{"$f":"'C'!O184","v":0},{"$f":"'C'!P184","v":0},null,{"$f":"'C'!Q184","v":0},{"$f":"'C'!R184","v":0},null,"","-","رشته: مدیریت تکنولوزی- گرایش:  - دکتری - دانشجویان ترم 01 - روزانه و پردیس"]
[{"$f":"ROWS(A$2:C170)","v":169},"كارشناسي ارشد","كارآفريني","كسب و كار جديد","روزانه و پردیس","مدیریت استراتژیک کارآفرینی",2,null,"نورعلیزاده","3991","ترم 01","3991","مدیریت و فلسفه علم و فناوری",{"$f":"CONCATENATE('C'!O133,CHAR(10),'C'!P133)","v":"\n"},{"$f":"CONCATENATE('C'!Q133,CHAR(10),'C'!R133)","v":"\n"},"\n-",null,null,null,null,null,"17-18:30",null,null,"16-17:30",null,null,"چهارشنبه",{"$f":"'C'!P186","v":0},null,"10-12",{"$f":"'C'!R186","v":0},null,"","-","رشته: كارآفريني- گرایش: كسب و كار جديد - كارشناسي ارشد - دانشجویان ترم 01 - روزانه و پردیس"]
[{"$f":"ROWS(A$2:C171)","v":170},"كارشناسي ارشد","مدیریت تکنولوزی",null,"روزانه و پردیس","مدیریت استراتژیک صنعتی",2,null,"نورعلیزاده","3991","ترم 01","3991","مدیریت و مهندسی کسب وکار",{"$f":"CONCATENATE('C'!O165,CHAR(10),'C'!P165)","v":"\n"},{"$f":"CONCATENATE('C'!Q165,CHAR(10),'C'!R165)","v":"\n"},"\n-",null,null,null,null,null,"17-18:30",null,null,"14:30-16",null,null,{"$f":"'C'!O187","v":0},{"$f":"'C'!P187","v":0},null,{"$f":"'C'!Q187","v":0},{"$f":"'C'!R187","v":0},null,"","-","رشته: مدیریت تکنولوزی- گرایش:  - كارشناسي ارشد - دانشجویان ترم 01 - روزانه و پردیس"]
[{"$f":"ROWS(A$2:C172)","v":171},"كارشناسي ارشد","مدیریت کسب و کار",null,"روزانه و پردیس","مدیریت استراتژیک",3,null,"نورعلیزاده","3991","ترم 01","3991","مدیریت و مهندسی کسب وکار",{"$f":"CONCATENATE('C'!O194,CHAR(10),'C'!P194)","v":"\n"},{"$f":"CONCATENATE('C'!Q194,CHAR(10),'C'!R194)","v":"\n"},"\n-",null,null,null,null,null,"15-16",null,"15-16","17:30-18:30",null,null,{"$f":"'C'!O188","v":0},{"$f":"'C'!P188","v":0},null,{"$f":"'C'!Q188","v":0},{"$f":"'C'!R188","v":0},null,"","-","رشته: مدیریت کسب و کار- گرایش:  - كارشناسي ارشد - دانشجویان ترم 01 - روزانه و پردیس"]
[{"$f":"ROWS(A$2:C173)","v":172},"كارشناسي ارشد","مدیریت کسب و کار",null,"روزانه و پردیس","مدیریت فناوری و نوآوری",3,null,"نورعلیزاده","3991","ترم 03","3981","مدیریت و مهندسی کسب وکار",{"$f":"CONCATENATE('C'!O184,CHAR(10),'C'!P184)","v":"\n"},{"$f":"CONCATENATE('C'!Q184,CHAR(10),'C'!R184)","v":"\n"},"\n-",null,null,null,null,null,"16-17",null,"16-17",null,null,null,"چهارشنبه",{"$f":"'C'!P190","v":0},null,"15-17",{"$f":"'C'!R190","v":0},null,"","-",{"$f":"CONCATENATE(\"رشته: \",C173,\"-\",\" گرایش: \",D173,\" - \",B173,\" - دانشجویان \",K173,\" - \",E173)","v":"رشته: مدیریت کسب و کار- گرایش:  - كارشناسي ارشد - دانشجویان ترم 03 - روزانه و پردیس"}]
[{"$f":"ROWS(A$2:C174)","v":173},"كارشناسي ارشد","مديريت فناوري اطلاعات","كسب و كار الكترونيك","روزانه و پردیس","سیستم های سازمانی",2,null,"وحیدی",3991,"ترم 03",3981,"مدیریت و فلسفه علم و فناوری",{"$f":"CONCATENATE('C'!O96,CHAR(10),'C'!P96)","v":"\n"},{"$f":"CONCATENATE('C'!Q96,CHAR(10),'C'!R96)","v":"\n"},"\n-",null,null,null,null,null,null,"10-11:30",null,null,null,null,"چهارشنبه",{"$f":"'C'!P192","v":0},null,"13-15",{"$f":"'C'!R192","v":0},null,"","-","رشته: مديريت فناوري اطلاعات- گرایش: كسب و كار الكترونيك - كارشناسي ارشد - دانشجویان ترم 03 - روزانه و پردیس"]
[{"$f":"ROWS(A$2:C175)","v":174},"كارشناسي ارشد","علوم اقتصادی","برنامه ريزي سيستمهاي اقتصادي","روزانه","پایان نامه","3",null,null,3991,"ترم 03",3981,"مهندسی پیشرفت اقتصادی",{"$f":"CONCATENATE('C'!O124,CHAR(10),'C'!P124)","v":"\n"},{"$f":"CONCATENATE('C'!Q124,CHAR(10),'C'!R124)","v":"\n"},"\n-",null,null,null,null,null,null,null,null,null,null,null,{"$f":"'C'!O194","v":0},{"$f":"'C'!P194","v":0},null,{"$f":"'C'!Q194","v":0},{"$f":"'C'!R194","v":0},null,"","-","رشته: علوم اقتصادی- گرایش: برنامه ريزي سيستمهاي اقتصادي - كارشناسي ارشد - دانشجویان ترم 03 - روزانه"]
[{"$f":"ROWS(A$2:C176)","v":175},"كارشناسي ارشد","علوم اقتصادی","توسعه اقتصادي و برنامه ريزي","روزانه","پایان نامه","6",null,null,3991,"ترم 03",3981,"مهندسی پیشرفت اقتصادی",{"$f":"CONCATENATE('C'!O126,CHAR(10),'C'!P126)","v":"\n"},{"$f":"CONCATENATE('C'!Q126,CHAR(10),'C'!R126)","v":"\n"},"\n-",null,null,null,null,null,null,null,null,null,null,null,"دوشنبه",{"$f":"'C'!P196","v":0},null,"10-12",{"$f":"'C'!R196","v":0},null,"","-","رشته: علوم اقتصادی- گرایش: توسعه اقتصادي و برنامه ريزي - كارشناسي ارشد - دانشجویان ترم 03 - روزانه"]
[{"$f":"ROWS(A$2:C177)","v":176},"كارشناسي ارشد","كارآفريني","كسب و كار جديد","روزانه و پردیس","پایان نامه","4",null,null,"3991","ترم 03",3981,"مدیریت و فلسفه علم و فناوری",{"$f":"CONCATENATE('C'!O138,CHAR(10),'C'!P138)","v":"\n"},{"$f":"CONCATENATE('C'!Q138,CHAR(10),'C'!R138)","v":"\n"},"\n-",null,null,null,null,null,null,null,null,null,null,null,{"$f":"'C'!O197","v":0},{"$f":"'C'!P197","v":0},null,{"$f":"'C'!Q197","v":0},{"$f":"'C'!R197","v":0},null,"","-","رشته: كارآفريني- گرایش: كسب و كار جديد - كارشناسي ارشد - دانشجویان ترم 03 - روزانه و پردیس"]
[{"$f":"ROWS(A$2:C178)","v":177},"کارشناسی ارشد","مدیریت تکنولوزی",null,"آموزش الکترونیکی","اصول و مبانی مدیریت تکنولوژِی",2,null,"مشایخ","3991","ترم 01","3991","مدیریت و مهندسی کسب وکار",{"$f":"CONCATENATE('C'!O166,CHAR(10),'C'!P166)","v":"\n"},{"$f":"CONCATENATE('C'!Q166,CHAR(10),'C'!R166)","v":"\n"},"\n-",null,null,null,null,null,null,null,null,null,null,null,{"$f":"'C'!O198","v":0},{"$f":"'C'!P198","v":0},null,{"$f":"'C'!Q198","v":0},{"$f":"'C'!R198","v":0},null,"","-","رشته: مدیریت تکنولوزی- گرایش:  - کارشناسی ارشد - دانشجویان ترم 01 - آموزش الکترونیکی"]
[{"$f":"ROWS(A$2:C179)","v":178},"کارشناسی ارشد","مدیریت تکنولوزی",null,"آموزش الکترونیکی","تصمیم گیری و تحقیق در عملیات",2,null,"سبحانی","3991","ترم 01","3991","مدیریت و مهندسی کسب وکار",{"$f":"CONCATENATE('C'!O167,CHAR(10),'C'!P167)","v":"\n"},{"$f":"CONCATENATE('C'!Q167,CHAR(10),'C'!R167)","v":"\n"},"\n-",null,null,null,null,null,null,null,null,null,null,null,{"$f":"'C'!O199","v":0},{"$f":"'C'!P199","v":0},null,{"$f":"'C'!Q199","v":0},{"$f":"'C'!R199","v":0},null,"","-","رشته: مدیریت تکنولوزی- گرایش:  - کارشناسی ارشد - دانشجویان ترم 01 - آموزش الکترونیکی"]
[{"$f":"ROWS(A$2:C180)","v":179},"کارشناسی ارشد","مدیریت تکنولوزی",null,"آموزش الکترونیکی","نظریه های مدیریت پیشرفته",2,null,"عبدالحمید","3991","ترم 01","3991","مدیریت و مهندسی کسب وکار",{"$f":"CONCATENATE('C'!O168,CHAR(10),'C'!P168)","v":"\n"},{"$f":"CONCATENATE('C'!Q168,CHAR(10),'C'!R168)","v":"\n"},"\n-",null,null,null,null,null,null,null,null,null,null,null,{"$f":"'C'!O200","v":0},{"$f":"'C'!P200","v":0},null,{"$f":"'C'!Q200","v":0},{"$f":"'C'!R200","v":0},null,"","-","رشته: مدیریت تکنولوزی- گرایش:  - کارشناسی ارشد - دانشجویان ترم 01 - آموزش الکترونیکی"]
[{"$f":"ROWS(A$2:C181)","v":180},"کارشناسی ارشد","مدیریت تکنولوزی",null,"آموزش الکترونیکی","تئوری های اقتصادی و سیر تحول تکنولوژی",2,null,"میرزامحمدی","3991","ترم 01","3991","مدیریت و مهندسی کسب وکار",{"$f":"CONCATENATE('C'!O169,CHAR(10),'C'!P169)","v":"\n"},{"$f":"CONCATENATE('C'!Q169,CHAR(10),'C'!R169)","v":"\n"},"\n-",null,null,null,null,null,null,null,null,null,null,null,{"$f":"'C'!O201","v":0},{"$f":"'C'!P201","v":0},null,{"$f":"'C'!Q201","v":0},{"$f":"'C'!R201","v":0},null,"","-","رشته: مدیریت تکنولوزی- گرایش:  - کارشناسی ارشد - دانشجویان ترم 01 - آموزش الکترونیکی"]
[{"$f":"ROWS(A$2:C182)","v":181},"کارشناسی ارشد","مدیریت تکنولوزی",null,"آموزش الکترونیکی","سیستم اطلاعات مدیریت تکنولوژی",2,null,"فتحیان","3991","ترم 01","3991","مدیریت و مهندسی کسب وکار",{"$f":"CONCATENATE('C'!O170,CHAR(10),'C'!P170)","v":"\n"},{"$f":"CONCATENATE('C'!Q170,CHAR(10),'C'!R170)","v":"\n"},"\n-",null,null,null,null,null,null,null,null,null,null,null,{"$f":"'C'!O202","v":0},{"$f":"'C'!P202","v":0},null,{"$f":"'C'!Q202","v":0},{"$f":"'C'!R202","v":0},null,"","-","رشته: مدیریت تکنولوزی- گرایش:  - کارشناسی ارشد - دانشجویان ترم 01 - آموزش الکترونیکی"]
[{"$f":"ROWS(A$2:C183)","v":182},"کارشناسی ارشد","مدیریت تکنولوزی",null,"آموزش الکترونیکی","مدیریت استراتژیک صنعتی",2,null,"علی احمدی","3991","ترم 01","3991","مدیریت و مهندسی کسب وکار",{"$f":"CONCATENATE('C'!O171,CHAR(10),'C'!P171)","v":"\n"},{"$f":"CONCATENATE('C'!Q171,CHAR(10),'C'!R171)","v":"\n"},"\n-",null,null,null,null,null,null,null,null,null,null,null,{"$f":"'C'!O203","v":0},{"$f":"'C'!P203","v":0},null,{"$f":"'C'!Q203","v":0},{"$f":"'C'!R203","v":0},null,"","-","رشته: مدیریت تکنولوزی- گرایش:  - کارشناسی ارشد - دانشجویان ترم 01 - آموزش الکترونیکی"]
[{"$f":"ROWS(A$2:C184)","v":183},"کارشناسی ارشد","مدیریت تکنولوزی",null,"آموزش الکترونیکی","تئوریهای اقتصادی و سیر تحول تکنولوژی",2,null,"شوال پور","3991","ترم 03","3981","مدیریت و مهندسی کسب وکار",{"$f":"CONCATENATE('C'!O172,CHAR(10),'C'!P172)","v":"\n"},{"$f":"CONCATENATE('C'!Q172,CHAR(10),'C'!R172)","v":"\n"},"\n-",null,null,null,null,null,null,null,null,null,null,null,{"$f":"'C'!O204","v":0},{"$f":"'C'!P204","v":0},null,{"$f":"'C'!Q204","v":0},{"$f":"'C'!R204","v":0},null,"","-","رشته: مدیریت تکنولوزی- گرایش:  - کارشناسی ارشد - دانشجویان ترم 03 - آموزش الکترونیکی"]
[{"$f":"ROWS(A$2:C185)","v":184},"کارشناسی ارشد","مدیریت تکنولوزی",null,"آموزش الکترونیکی","تیوریهای نوآوری، مدلها و فرایندها",2,null,"نریمانی","3991","ترم 03","3981","مدیریت و مهندسی کسب وکار",{"$f":"CONCATENATE('C'!O173,CHAR(10),'C'!P173)","v":"\n"},{"$f":"CONCATENATE('C'!Q173,CHAR(10),'C'!R173)","v":"\n"},"\n-",null,null,null,null,null,null,null,null,null,null,null,{"$f":"'C'!O205","v":0},{"$f":"'C'!P205","v":0},null,{"$f":"'C'!Q205","v":0},{"$f":"'C'!R205","v":0},null,"","-","رشته: مدیریت تکنولوزی- گرایش:  - کارشناسی ارشد - دانشجویان ترم 03 - آموزش الکترونیکی"]
[{"$f":"ROWS(A$2:C186)","v":185},"کارشناسی ارشد","مدیریت تکنولوزی",null,"آموزش الکترونیکی","سیستم های اطلاعات مدیریت تکنولوژی",2,null,"فتحیان","3991","ترم 03","3981","مدیریت و مهندسی کسب وکار",{"$f":"CONCATENATE('C'!O174,CHAR(10),'C'!P174)","v":"\n"},{"$f":"CONCATENATE('C'!Q174,CHAR(10),'C'!R174)","v":"\n"},"\n-",null,null,null,null,null,null,null,null,null,null,null,{"$f":"'C'!O206","v":0},{"$f":"'C'!P206","v":0},null,{"$f":"'C'!Q206","v":0},{"$f":"'C'!R206","v":0},null,"","-","رشته: مدیریت تکنولوزی- گرایش:  - کارشناسی ارشد - دانشجویان ترم 03 - آموزش الکترونیکی"]
[{"$f":"ROWS(A$2:C187)","v":186},"کارشناسی ارشد","مدیریت تکنولوزی",null,"آموزش الکترونیکی","سازمان های تحقیق و توسعه پارک های فناوری اطلاعات",2,null,"قادری فر","3991","ترم 03","3981","مدیریت و مهندسی کسب وکار",{"$f":"CONCATENATE('C'!O175,CHAR(10),'C'!P175)","v":"\n"},{"$f":"CONCATENATE('C'!Q175,CHAR(10),'C'!R175)","v":"\n"},"\n-",null,null,null,null,null,null,null,null,null,null,null,{"$f":"'C'!O207","v":0},{"$f":"'C'!P207","v":0},null,{"$f":"'C'!Q207","v":0},{"$f":"'C'!R207","v":0},null,"","-","رشته: مدیریت تکنولوزی- گرایش:  - کارشناسی ارشد - دانشجویان ترم 03 - آموزش الکترونیکی"]
[{"$f":"ROWS(A$2:C188)","v":187},"کارشناسی ارشد","مدیریت تکنولوزی",null,"آموزش الکترونیکی","تکنولوژی نو و محیط زیست",2,null," حسین زاده","3991","ترم 03","3981","مدیریت و مهندسی کسب وکار",{"$f":"CONCATENATE('C'!O176,CHAR(10),'C'!P176)","v":"\n"},{"$f":"CONCATENATE('C'!Q176,CHAR(10),'C'!R176)","v":"\n"},"\n-",null,null,null,null,null,null,null,null,null,null,null,{"$f":"'C'!O208","v":0},{"$f":"'C'!P208","v":0},null,{"$f":"'C'!Q208","v":0},{"$f":"'C'!R208","v":0},null,"","-","رشته: مدیریت تکنولوزی- گرایش:  - کارشناسی ارشد - دانشجویان ترم 03 - آموزش الکترونیکی"]
[{"$f":"ROWS(A$2:C189)","v":188},"کارشناسی ارشد","مدیریت تکنولوزی",null,"آموزش الکترونیکی","تئوریهای اقتصادی و سیر تحول تکنولوژی",2,null,"شوال پور","3991","ترم 02","3982","مدیریت و مهندسی کسب وکار",{"$f":"CONCATENATE('C'!O177,CHAR(10),'C'!P177)","v":"\n"},{"$f":"CONCATENATE('C'!Q177,CHAR(10),'C'!R177)","v":"\n"},"\n-",null,null,null,null,null,null,null,null,null,null,null,{"$f":"'C'!O209","v":0},{"$f":"'C'!P209","v":0},null,{"$f":"'C'!Q209","v":0},{"$f":"'C'!R209","v":0},null,"","-","رشته: مدیریت تکنولوزی- گرایش:  - کارشناسی ارشد - دانشجویان ترم 02 - آموزش الکترونیکی"]
[{"$f":"ROWS(A$2:C190)","v":189},"کارشناسی ارشد","مدیریت تکنولوزی",null,"آموزش الکترونیکی","تیوریهای نوآوری، مدلها و فرایندها",2,null,"ذاکری-نریمانی","3991","ترم 02","3982","مدیریت و مهندسی کسب وکار",{"$f":"CONCATENATE('C'!O178,CHAR(10),'C'!P178)","v":"\n"},{"$f":"CONCATENATE('C'!Q178,CHAR(10),'C'!R178)","v":"\n"},"\n-",null,null,null,null,null,null,null,null,null,null,null,{"$f":"'C'!O210","v":0},{"$f":"'C'!P210","v":0},null,{"$f":"'C'!Q210","v":0},{"$f":"'C'!R210","v":0},null,"","-","رشته: مدیریت تکنولوزی- گرایش:  - کارشناسی ارشد - دانشجویان ترم 02 - آموزش الکترونیکی"]
[{"$f":"ROWS(A$2:C191)","v":190},"کارشناسی ارشد","مدیریت تکنولوزی",null,"آموزش الکترونیکی","سیستم های اطلاعات مدیریت تکنولوژی",2,null,"خانی زاد","3991","ترم 02","3982","مدیریت و مهندسی کسب وکار",{"$f":"CONCATENATE('C'!O179,CHAR(10),'C'!P179)","v":"\n"},{"$f":"CONCATENATE('C'!Q179,CHAR(10),'C'!R179)","v":"\n"},"\n-",null,null,null,null,null,null,null,null,null,null,null,{"$f":"'C'!O211","v":0},{"$f":"'C'!P211","v":0},null,{"$f":"'C'!Q211","v":0},{"$f":"'C'!R211","v":0},null,"","-","رشته: مدیریت تکنولوزی- گرایش:  - کارشناسی ارشد - دانشجویان ترم 02 - آموزش الکترونیکی"]
[{"$f":"ROWS(A$2:C192)","v":191},"کارشناسی ارشد","مدیریت تکنولوزی",null,"آموزش الکترونیکی","سازمان های تحقیق و توسعه پارک های فناوری اطلاعات",2,null,"علی احمدی","3991","ترم 02","3982","مدیریت و مهندسی کسب وکار",{"$f":"CONCATENATE('C'!O180,CHAR(10),'C'!P180)","v":"\n"},{"$f":"CONCATENATE('C'!Q180,CHAR(10),'C'!R180)","v":"\n"},"\n-",null,null,null,null,null,null,null,null,null,null,null,{"$f":"'C'!O212","v":0},{"$f":"'C'!P212","v":0},null,{"$f":"'C'!Q212","v":0},{"$f":"'C'!R212","v":0},null,"","-","رشته: مدیریت تکنولوزی- گرایش:  - کارشناسی ارشد - دانشجویان ترم 02 - آموزش الکترونیکی"]
[{"$f":"ROWS(A$2:C193)","v":192},"کارشناسی ارشد","مدیریت تکنولوزی",null,"آموزش الکترونیکی","تکنولوژی نو و محیط زیست",2,null,"حسین زاده","3991","ترم 02","3982","مدیریت و مهندسی کسب وکار",{"$f":"CONCATENATE('C'!O181,CHAR(10),'C'!P181)","v":"\n"},{"$f":"CONCATENATE('C'!Q181,CHAR(10),'C'!R181)","v":"\n"},"\n-",null,null,null,null,null,null,null,null,null,null,null,{"$f":"'C'!O213","v":0},{"$f":"'C'!P213","v":0},null,{"$f":"'C'!Q213","v":0},{"$f":"'C'!R213","v":0},null,"","-","رشته: مدیریت تکنولوزی- گرایش:  - کارشناسی ارشد - دانشجویان ترم 02 - آموزش الکترونیکی"]
[{"$f":"ROWS(A$2:C194)","v":193},"كارشناسي ارشد","مديريت فناوري اطلاعات","كسب و كار الكترونيك","پردیس","پایان نامه",4,null,null,3991,"ترم 03","3971 و قبل تر","مدیریت و فلسفه علم و فناوری",{"$f":"CONCATENATE('C'!O116,CHAR(10),'C'!P116)","v":"\n"},{"$f":"CONCATENATE('C'!Q116,CHAR(10),'C'!R116)","v":"\n"},"\n-",null,null,null,null,null,null,null,null,null,null,null,{"$f":"'C'!O216","v":0},{"$f":"'C'!P216","v":0},null,{"$f":"'C'!Q216","v":0},{"$f":"'C'!R216","v":0},null,"","-",{"$f":"CONCATENATE(\"رشته: \",C194,\"-\",\" گرایش: \",D194,\" - \",B194,\" - دانشجویان \",K194,\" - \",E194)","v":"رشته: مديريت فناوري اطلاعات- گرایش: كسب و كار الكترونيك - كارشناسي ارشد - دانشجویان ترم 03 - پردیس"}]
[{"$f":"ROWS(A$2:C195)","v":194},"كارشناسي ارشد","مديريت فناوري اطلاعات","كسب و كار الكترونيك","روزانه","پایان نامه",4,null,null,3991,"ترم 03","3971 و قبل تر","مدیریت و فلسفه علم و فناوری",{"$f":"CONCATENATE('C'!O117,CHAR(10),'C'!P117)","v":"\n"},{"$f":"CONCATENATE('C'!Q117,CHAR(10),'C'!R117)","v":"\n"},"\n-",null,null,null,null,null,null,null,null,null,null,null,{"$f":"'C'!O217","v":0},{"$f":"'C'!P217","v":0},null,{"$f":"'C'!Q217","v":0},{"$f":"'C'!R217","v":0},null,"","-","رشته: مديريت فناوري اطلاعات- گرایش: كسب و كار الكترونيك - كارشناسي ارشد - دانشجویان ترم 03 - روزانه"]
[{"$f":"ROWS(A$2:C196)","v":195},"كارشناسي ارشد","مهندسي صنايع-سيستمهاي كلان","-","روزانه","پایان نامه","6",null,null,3991,"ترم 03",3981,"مهندسی پیشرفت اقتصادی",{"$f":"CONCATENATE('C'!O133,CHAR(10),'C'!P133)","v":"\n"},{"$f":"CONCATENATE('C'!Q133,CHAR(10),'C'!R133)","v":"\n"},"\n-",null,null,null,null,null,null,null,null,null,null,null,{"$f":"'C'!O218","v":0},{"$f":"'C'!P218","v":0},null,{"$f":"'C'!Q218","v":0},{"$f":"'C'!R218","v":0},null,"","-","رشته: مهندسي صنايع-سيستمهاي كلان- گرایش: - - كارشناسي ارشد - دانشجویان ترم 03 - روزانه"]
[{"$f":"ROWS(A$2:C197)","v":196},"كارشناسي ارشد","مهندسي صنايع-سيستمهاي كلان","-","روزانه","سمینار","1",null,null,3991,"ترم 03",3981,"مهندسی پیشرفت اقتصادی",{"$f":"CONCATENATE('C'!O135,CHAR(10),'C'!P135)","v":"\n"},{"$f":"CONCATENATE('C'!Q135,CHAR(10),'C'!R135)","v":"\n"},"\n-",null,null,null,null,null,null,null,null,null,null,null,"یکشنبه","سه شنبه",null,"9-10","9-10",null,"","-","رشته: مهندسي صنايع-سيستمهاي كلان- گرایش: - - كارشناسي ارشد - دانشجویان ترم 03 - روزانه"]
[{"$f":"ROWS(A$2:C198)","v":197},"کارشناسی ارشد","مدیریت کسب و کار",null,"آموزش الکترونیکی","حسابداری برای مدیران",3,null,"سجادی","3991","ترم 02","3982","مدیریت و مهندسی کسب وکار",{"$f":"CONCATENATE('C'!O198,CHAR(10),'C'!P198)","v":"\n"},{"$f":"CONCATENATE('C'!Q198,CHAR(10),'C'!R198)","v":"\n"},{"$f":"CONCATENATE(AH198,CHAR(10),AI198)","v":"\n-"},null,null,null,null,null,null,null,null,null,null,null,{"$f":"'C'!O230","v":0},{"$f":"'C'!P230","v":0},null,{"$f":"'C'!Q230","v":0},{"$f":"'C'!R230","v":0},null,"","-","رشته: مدیریت کسب و کار- گرایش:  - کارشناسی ارشد - دانشجویان ترم 02 - آموزش الکترونیکی"]
[{"$f":"ROWS(A$2:C199)","v":198},"کارشناسی ارشد","مدیریت کسب و کار",null,"آموزش الکترونیکی","مدیریت عملیات",3,null," محمدی","3991","ترم 02","3982","مدیریت و مهندسی کسب وکار",{"$f":"CONCATENATE('C'!O199,CHAR(10),'C'!P199)","v":"\n"},{"$f":"CONCATENATE('C'!Q199,CHAR(10),'C'!R199)","v":"\n"},"\n-",null,null,null,null,null,null,null,null,null,null,null,{"$f":"'C'!O231","v":0},{"$f":"'C'!P231","v":0},null,{"$f":"'C'!Q231","v":0},{"$f":"'C'!R231","v":0},null,"","-","رشته: مدیریت کسب و کار- گرایش:  - کارشناسی ارشد - دانشجویان ترم 02 - آموزش الکترونیکی"]
[{"$f":"ROWS(A$2:C200)","v":199},"کارشناسی ارشد","مدیریت کسب و کار",null,"آموزش الکترونیکی","مدیریت فناوری و نوآوری",3,null,"نورعلیزاده","3991","ترم 02","3982","مدیریت و مهندسی کسب وکار",{"$f":"CONCATENATE('C'!O200,CHAR(10),'C'!P200)","v":"\n"},{"$f":"CONCATENATE('C'!Q200,CHAR(10),'C'!R200)","v":"\n"},"\n-",null,null,null,null,null,null,null,null,null,null,null,{"$f":"'C'!O232","v":0},{"$f":"'C'!P232","v":0},null,{"$f":"'C'!Q232","v":0},{"$f":"'C'!R232","v":0},null,"","-","رشته: مدیریت کسب و کار- گرایش:  - کارشناسی ارشد - دانشجویان ترم 02 - آموزش الکترونیکی"]
[{"$f":"ROWS(A$2:C201)","v":200},"کارشناسی ارشد","مدیریت کسب و کار",null,"آموزش الکترونیکی","مدیریت دانش",3,null,"ذاکری","3991","ترم 02","3982","مدیریت و مهندسی کسب وکار",{"$f":"CONCATENATE('C'!O201,CHAR(10),'C'!P201)","v":"\n"},{"$f":"CONCATENATE('C'!Q201,CHAR(10),'C'!R201)","v":"\n"},"\n-",null,null,null,null,null,null,null,null,null,null,null,{"$f":"'C'!O233","v":0},{"$f":"'C'!P233","v":0},null,{"$f":"'C'!Q233","v":0},{"$f":"'C'!R233","v":0},null,"","-","رشته: مدیریت کسب و کار- گرایش:  - کارشناسی ارشد - دانشجویان ترم 02 - آموزش الکترونیکی"]
[{"$f":"ROWS(A$2:C202)","v":201},"کارشناسی ارشد","مدیریت کسب و کار",null,"آموزش الکترونیکی","مدیریت استراتژیک پیشرفته",3,null,"علی احمدی","3991","ترم 02","3982","مدیریت و مهندسی کسب وکار",{"$f":"CONCATENATE('C'!O202,CHAR(10),'C'!P202)","v":"\n"},{"$f":"CONCATENATE('C'!Q202,CHAR(10),'C'!R202)","v":"\n"},"\n-",null,null,null,null,null,null,null,null,null,null,null,{"$f":"'C'!O234","v":0},{"$f":"'C'!P234","v":0},null,{"$f":"'C'!Q234","v":0},{"$f":"'C'!R234","v":0},null,"","-","رشته: مدیریت کسب و کار- گرایش:  - کارشناسی ارشد - دانشجویان ترم 02 - آموزش الکترونیکی"]
[{"$f":"ROWS(A$2:C203)","v":202},"کارشناسی ارشد","مدیریت کسب و کار",null,"آموزش الکترونیکی","تحقیقات بازاریابی",3,null,"بنیادی","3991","ترم 02","3982","مدیریت و مهندسی کسب وکار",{"$f":"CONCATENATE('C'!O203,CHAR(10),'C'!P203)","v":"\n"},{"$f":"CONCATENATE('C'!Q203,CHAR(10),'C'!R203)","v":"\n"},{"$f":"CONCATENATE(AH203,CHAR(10),AI203)","v":"\n-"},null,null,null,null,null,null,null,null,null,null,null,{"$f":"'C'!O235","v":0},{"$f":"'C'!P235","v":0},null,{"$f":"'C'!Q235","v":0},{"$f":"'C'!R235","v":0},null,"","-",{"$f":"CONCATENATE(\"رشته: \",C203,\"-\",\" گرایش: \",D203,\" - \",B203,\" - دانشجویان \",K203,\" - \",E203)","v":"رشته: مدیریت کسب و کار- گرایش:  - کارشناسی ارشد - دانشجویان ترم 02 - آموزش الکترونیکی"}]
[{"$f":"ROWS(A$2:C204)","v":203},"کارشناسی ارشد","مدیریت کسب و کار",null,"آموزش الکترونیکی","حسابداری برای مدیران",3,null,"سجادی","3991","ترم 03","3981","مدیریت و مهندسی کسب وکار",{"$f":"CONCATENATE('C'!O204,CHAR(10),'C'!P204)","v":"\n"},{"$f":"CONCATENATE('C'!Q204,CHAR(10),'C'!R204)","v":"\n"},"\n-",null,null,null,null,null,null,null,null,null,null,null,{"$f":"'C'!O236","v":0},{"$f":"'C'!P236","v":0},null,{"$f":"'C'!Q236","v":0},{"$f":"'C'!R236","v":0},null,"","-","رشته: مدیریت کسب و کار- گرایش:  - کارشناسی ارشد - دانشجویان ترم 03 - آموزش الکترونیکی"]
[{"$f":"ROWS(A$2:C205)","v":204},"کارشناسی ارشد","مدیریت کسب و کار",null,"آموزش الکترونیکی","مدیریت عملیات",3,null,"سیدحسینی","3991","ترم 03","3981","مدیریت و مهندسی کسب وکار",{"$f":"CONCATENATE('C'!O205,CHAR(10),'C'!P205)","v":"\n"},{"$f":"CONCATENATE('C'!Q205,CHAR(10),'C'!R205)","v":"\n"},"\n-",null,null,null,null,null,null,null,null,null,null,null,{"$f":"'C'!O237","v":0},{"$f":"'C'!P237","v":0},null,{"$f":"'C'!Q237","v":0},{"$f":"'C'!R237","v":0},null,"","-","رشته: مدیریت کسب و کار- گرایش:  - کارشناسی ارشد - دانشجویان ترم 03 - آموزش الکترونیکی"]
[{"$f":"ROWS(A$2:C206)","v":205},"کارشناسی ارشد","مدیریت کسب و کار",null,"آموزش الکترونیکی","مدیریت دانش",3,null,"ذاکری","3991","ترم 03","3981","مدیریت و مهندسی کسب وکار",{"$f":"CONCATENATE('C'!O207,CHAR(10),'C'!P207)","v":"\n"},{"$f":"CONCATENATE('C'!Q207,CHAR(10),'C'!R207)","v":"\n"},"\n-",null,null,null,null,null,null,null,null,null,null,null,{"$f":"'C'!O239","v":0},{"$f":"'C'!P239","v":0},null,{"$f":"'C'!Q239","v":0},{"$f":"'C'!R239","v":0},null,"","-","رشته: مدیریت کسب و کار- گرایش:  - کارشناسی ارشد - دانشجویان ترم 03 - آموزش الکترونیکی"]
[{"$f":"ROWS(A$2:C207)","v":206},"کارشناسی ارشد","مدیریت کسب و کار","استراتژي","آموزش الکترونیکی","مدیریت استراتژیک پیشرفته",3,null,"علی احمدی","3991","ترم 03","3981","مدیریت و مهندسی کسب وکار",{"$f":"CONCATENATE('C'!O208,CHAR(10),'C'!P208)","v":"\n"},{"$f":"CONCATENATE('C'!Q208,CHAR(10),'C'!R208)","v":"\n"},"\n-",null,null,null,null,null,null,null,null,null,null,null,{"$f":"'C'!O240","v":0},{"$f":"'C'!P240","v":0},null,{"$f":"'C'!Q240","v":0},{"$f":"'C'!R240","v":0},null,"","-","رشته: مدیریت کسب و کار- گرایش: استراتژي - کارشناسی ارشد - دانشجویان ترم 03 - آموزش الکترونیکی"]
[{"$f":"ROWS(A$2:C208)","v":207},"کارشناسی ارشد","مدیریت کسب و کار","بازاریابی","آموزش الکترونیکی","تحقیقات بازاریابی",3,null,"بنیادی","3991","ترم 03","3981","مدیریت و مهندسی کسب وکار",{"$f":"CONCATENATE('C'!O209,CHAR(10),'C'!P209)","v":"\n"},{"$f":"CONCATENATE('C'!Q209,CHAR(10),'C'!R209)","v":"\n"},"\n-",null,null,null,null,null,null,null,null,null,null,null,{"$f":"'C'!O241","v":0},{"$f":"'C'!P241","v":0},null,{"$f":"'C'!Q241","v":0},{"$f":"'C'!R241","v":0},null,"","-","رشته: مدیریت کسب و کار- گرایش: بازاریابی - کارشناسی ارشد - دانشجویان ترم 03 - آموزش الکترونیکی"]

{"sheet":"CC","index":1,"n_rows":26,"n_cols":9,"rows_kept":26,"cut":false,"hidden":false,"merged":[]}
[null,"برنامه هفتگی کلاس:",207,"نیمسال دوم 98-99",null,null,null,null,"کلاس"]
["روز/ساعت","7-8","8-10","10-12","13-15","15-17","17-19",null,207]
["شنبه",{"$f":"IFERROR(VLOOKUP(B10,Sheet2!$A:$B,2,FALSE),\"\")","v":""},{"$f":"IFERROR(VLOOKUP(C10,Sheet2!$A:$B,2,FALSE),\"\")","v":"سيستمهاي ديناميكي1\nروزانه - پارسانژاد"},{"$f":"IFERROR(VLOOKUP(D10,Sheet2!$A:$B,2,FALSE),\"\")","v":"اقتصاد كلان\nروزانه - رفیعی"},{"$f":"IFERROR(VLOOKUP(E10,Sheet2!$A:$B,2,FALSE),\"\")","v":"اقتصاد سنجي ( جبرانی )\nروزانه - شوال پور"},{"$f":"IFERROR(VLOOKUP(F10,Sheet2!$A:$B,2,FALSE),\"\")","v":"تحلیل تصمیم گیری\nروزانه - کرمانی"},{"$f":"IFERROR(VLOOKUP(G10,Sheet2!$A:$B,2,FALSE),\"\")","v":""},null,208]
["یکشنبه",{"$f":"IFERROR(VLOOKUP(B11,Sheet2!$A:$B,2,FALSE),\"\")","v":""},{"$f":"IFERROR(VLOOKUP(C11,Sheet2!$A:$B,2,FALSE),\"\")","v":"اقتصاد كلان پيشرفته\nروزانه - میرزامحمدی"},{"$f":"IFERROR(VLOOKUP(D11,Sheet2!$A:$B,2,FALSE),\"\")","v":"داده كاوي: مدلها، الگوريتمها و كاربردها\nروزانه - رسولی"},{"$f":"IFERROR(VLOOKUP(E11,Sheet2!$A:$B,2,FALSE),\"\")","v":"مدلسازي پوياييهاي سيستم\nروزانه - پارسانژاد"},{"$f":"IFERROR(VLOOKUP(F11,Sheet2!$A:$B,2,FALSE),\"\")","v":"مفاهیم و مدلهای تحلیل شبکه های اجتماعی\nروزانه - کرمانی"},{"$f":"IFERROR(VLOOKUP(G11,Sheet2!$A:$B,2,FALSE),\"\")","v":""},null,209]
["دوشنبه",{"$f":"IFERROR(VLOOKUP(B12,Sheet2!$A:$B,2,FALSE),\"\")","v":""},{"$f":"IFERROR(VLOOKUP(C12,Sheet2!$A:$B,2,FALSE),\"\")","v":"مدلهاي كسب و كار الكترونيك\nروزانه - صالحی"},{"$f":"IFERROR(VLOOKUP(D12,Sheet2!$A:$B,2,FALSE),\"\")","v":"مباني تئوري و فلسفي سيستمهاي اطلاعاتي\nروزانه - رفیعی آتانی"},{"$f":"IFERROR(VLOOKUP(E12,Sheet2!$A:$B,2,FALSE),\"\")","v":""},{"$f":"IFERROR(VLOOKUP(F12,Sheet2!$A:$B,2,FALSE),\"\")","v":"مديريت امنيت فناوري اطلاعات\nروزانه - خانی زاد"},{"$f":"IFERROR(VLOOKUP(G12,Sheet2!$A:$B,2,FALSE),\"\")","v":""},null,210]
["سه شنبه",{"$f":"IFERROR(VLOOKUP(B13,Sheet2!$A:$B,2,FALSE),\"\")","v":""},{"$f":"IFERROR(VLOOKUP(C13,Sheet2!$A:$B,2,FALSE),\"\")","v":"سيستمهاي ديناميكي1\nروزانه - پارسانژاد"},{"$f":"IFERROR(VLOOKUP(D13,Sheet2!$A:$B,2,FALSE),\"\")","v":"داده كاوي: مدلها، الگوريتمها و كاربردها\nروزانه - رسولی"},{"$f":"IFERROR(VLOOKUP(E13,Sheet2!$A:$B,2,FALSE),\"\")","v":"مدلسازي پوياييهاي سيستم\nروزانه - پارسانژاد"},{"$f":"IFERROR(VLOOKUP(F13,Sheet2!$A:$B,2,FALSE),\"\")","v":"مفاهیم و مدلهای تحلیل شبکه های اجتماعی\nروزانه - کرمانی"},{"$f":"IFERROR(VLOOKUP(G13,Sheet2!$A:$B,2,FALSE),\"\")","v":""},null,213]
["چهارشنبه",{"$f":"IFERROR(VLOOKUP(B14,Sheet2!$A:$B,2,FALSE),\"\")","v":""},{"$f":"IFERROR(VLOOKUP(C14,Sheet2!$A:$B,2,FALSE),\"\")","v":"علم ، فناوري و جامعه\nروزانه و پردیس - رفیعی"},{"$f":"IFERROR(VLOOKUP(D14,Sheet2!$A:$B,2,FALSE),\"\")","v":"انتقال علم و فناوري\nروزانه و پردیس - منطقی"},{"$f":"IFERROR(VLOOKUP(E14,Sheet2!$A:$B,2,FALSE),\"\")","v":"ارزیابی سرمایه گذاری و مدیریت ریسک فناوری\nروزانه و پردیس - شوال پور"},{"$f":"IFERROR(VLOOKUP(F14,Sheet2!$A:$B,2,FALSE),\"\")","v":"مدلهاي سياستگذاري علم و فناوري\nروزانه و پردیس - سیف الدین"},{"$f":"IFERROR(VLOOKUP(G14,Sheet2!$A:$B,2,FALSE),\"\")","v":""},null,211]
["پنج شنبه",{"$f":"IFERROR(VLOOKUP(B15,Sheet2!$A:$B,2,FALSE),\"\")","v":""},{"$f":"IFERROR(VLOOKUP(C15,Sheet2!$A:$B,2,FALSE),\"\")","v":"سيستمهاي يكپارچه كسب و كار الكترونيك\nپردیس - وحیدی"},{"$f":"IFERROR(VLOOKUP(D15,Sheet2!$A:$B,2,FALSE),\"\")","v":"مديريت امنيت فناوري اطلاعات\nپردیس - خانی زاد"},{"$f":"IFERROR(VLOOKUP(E15,Sheet2!$A:$B,2,FALSE),\"\")","v":""},{"$f":"IFERROR(VLOOKUP(F15,Sheet2!$A:$B,2,FALSE),\"\")","v":""},{"$f":"IFERROR(VLOOKUP(G15,Sheet2!$A:$B,2,FALSE),\"\")","v":""},null,212]
[null,null,null,null,null,null,null,null,214]
["شنبه",{"$f":"CONCATENATE($A10,\" - \",B$2,\" - \",$C$1)","v":"شنبه - 7-8 - 207"},"شنبه - 8-10 - 207","شنبه - 10-12 - 207","شنبه - 13-15 - 207","شنبه - 15-17 - 207","شنبه - 17-19 - 207",null,215]
["یکشنبه","یکشنبه - 7-8 - 207","یکشنبه - 8-10 - 207","یکشنبه - 10-12 - 207","یکشنبه - 13-15 - 207","یکشنبه - 15-17 - 207","یکشنبه - 17-19 - 207",null,216]
["دوشنبه","دوشنبه - 7-8 - 207","دوشنبه - 8-10 - 207","دوشنبه - 10-12 - 207","دوشنبه - 13-15 - 207","دوشنبه - 15-17 - 207","دوشنبه - 17-19 - 207",null,217]
["سه شنبه","سه شنبه - 7-8 - 207","سه شنبه - 8-10 - 207","سه شنبه - 10-12 - 207","سه شنبه - 13-15 - 207","سه شنبه - 15-17 - 207","سه شنبه - 17-19 - 207",null,301]
["چهارشنبه","چهارشنبه - 7-8 - 207","چهارشنبه - 8-10 - 207",{"$f":"CONCATENATE($A14,\" - \",D$2,\" - \",$C$1)","v":"چهارشنبه - 10-12 - 207"},{"$f":"CONCATENATE($A14,\" - \",E$2,\" - \",$C$1)","v":"چهارشنبه - 13-15 - 207"},{"$f":"CONCATENATE($A14,\" - \",F$2,\" - \",$C$1)","v":"چهارشنبه - 15-17 - 207"},{"$f":"CONCATENATE($A14,\" - \",G$2,\" - \",$C$1)","v":"چهارشنبه - 17-19 - 207"},null,302]
["پنج شنبه","پنج شنبه - 7-8 - 207","پنج شنبه - 8-10 - 207","پنج شنبه - 10-12 - 207",{"$f":"CONCATENATE($A15,\" - \",E$2,\" - \",$C$1)","v":"پنج شنبه - 13-15 - 207"},{"$f":"CONCATENATE($A15,\" - \",F$2,\" - \",$C$1)","v":"پنج شنبه - 15-17 - 207"},"پنج شنبه - 17-19 - 207",null,303]
[null,null,null,null,null,null,null,null,304]
[null,null,null,null,null,null,null,null,305]
[null,null,null,null,null,null,null,null,306]
[null,null,null,null,null,null,null,null,307]
[null,null,null,null,null,null,null,null,308]
[null,null,null,null,null,null,null,null,309]
[null,null,null,null,null,null,null,null,310]
[null,null,null,null,null,null,null,null,311]
[null,null,null,null,null,null,null,null,312]
[null,null,null,null,null,null,null,null,313]
[null,null,null,null,null,null,null,null,314]

{"sheet":"B","index":2,"n_rows":83,"n_cols":24,"rows_kept":83,"cut":false,"hidden":false,"merged":[]}
["عنوان کامل","if found","frecouncy","searchable list","رشته: مديريت كسب و كار- گرایش: استراتژي - كارشناسي ارشد - دانشجویان ترم 04 - روزانه",null,null,null,null,null,null,null,null,null,null,null,null,null,null,null,null,null,null,"عنوان کامل"]
["رشته: علوم اقتصادی- گرایش: برنامه ريزي سيستمهاي اقتصادي - كارشناسي ارشد - دانشجویان ترم 02 - روزانه",{"$f":"--ISNUMBER(SEARCH($E$1,X:X))","v":0},{"$f":"IF(B2=1,+COUNTIF($B$2:$B2,1),\"\")","v":""},{"$f":"IFERROR(INDEX($X$2:$X$400,MATCH(ROWS($C$2:$C2),$C$2:$C400,0)),\"\")","v":"رشته: مديريت كسب و كار- گرایش: استراتژي - كارشناسي ارشد - دانشجویان ترم 04 - روزانه"},null,null,null,null,null,null,{"$f":"ROWS($C$2:$C2)","v":1},null,null,{"$f":"E1","v":"رشته: مديريت كسب و كار- گرایش: استراتژي - كارشناسي ارشد - دانشجویان ترم 04 - روزانه"},null,null,null,null,null,null,null,null,null,{"$f":"CONCATENATE(\"رشته: \",w!C2,\"-\",\" گرایش: \",w!D2,\" - \",w!B2,\" - دانشجویان \",w!K2,\" - \",w!E2)","v":"رشته: علوم اقتصادی- گرایش: برنامه ريزي سيستمهاي اقتصادي - كارشناسي ارشد - دانشجویان ترم 02 - روزانه"}]
["رشته: علوم اقتصادی- گرایش: برنامه ريزي سيستمهاي اقتصادي - كارشناسي ارشد - دانشجویان ترم 04 و بیشتر - روزانه",{"$f":"--ISNUMBER(SEARCH($E$1,X:X))","v":0},{"$f":"IF(B3=1,+COUNTIF($B$2:$B3,1),\"\")","v":""},{"$f":"IFERROR(INDEX($X$2:$X$400,MATCH(ROWS($C$2:$C3),$C$2:$C401,0)),\"\")","v":"رشته: مديريت كسب و كار- گرایش: استراتژي - كارشناسي ارشد - دانشجویان ترم 04 - روزانه"},null,null,null,null,null,null,{"$f":"ROWS($C$2:$C3)","v":2},null,null,null,null,null,null,"مشخصات ارائه",null,null,"زمان امتحان",null,null,{"$f":"CONCATENATE(\"رشته: \",w!C3,\"-\",\" گرایش: \",w!D3,\" - \",w!B3,\" - دانشجویان \",w!K3,\" - \",w!E3)","v":"رشته: علوم اقتصادی- گرایش: برنامه ريزي سيستمهاي اقتصادي - كارشناسي ارشد - دانشجویان ترم 02 - روزانه"}]
["رشته: علوم اقتصادی- گرایش: توسعه اقتصادي و برنامه ريزي - كارشناسي ارشد - دانشجویان ترم 02 - روزانه",0,{"$f":"IF(B4=1,+COUNTIF($B$2:$B4,1),\"\")","v":""},{"$f":"IFERROR(INDEX($X$2:$X$400,MATCH(ROWS($C$2:$C4),$C$2:$C402,0)),\"\")","v":"رشته: مديريت كسب و كار- گرایش: استراتژي - كارشناسي ارشد - دانشجویان ترم 04 - روزانه"},null,null,null,null,null,null,{"$f":"ROWS($C$2:$C4)","v":3},null,null,"نام درس"," واحد","استاد","روز","ساعت","کلاس","تاریخ","ساعت","توضیحات",null,{"$f":"CONCATENATE(\"رشته: \",w!C4,\"-\",\" گرایش: \",w!D4,\" - \",w!B4,\" - دانشجویان \",w!K4,\" - \",w!E4)","v":"رشته: علوم اقتصادی- گرایش: برنامه ريزي سيستمهاي اقتصادي - كارشناسي ارشد - دانشجویان ترم 02 - روزانه"}]
["رشته: علوم اقتصادی- گرایش: توسعه اقتصادي و برنامه ريزي - كارشناسي ارشد - دانشجویان ترم 04 و بیشتر - روزانه",0,{"$f":"IF(B5=1,+COUNTIF($B$2:$B5,1),\"\")","v":""},{"$f":"IFERROR(INDEX($X$2:$X$400,MATCH(ROWS($C$2:$C5),$C$2:$C403,0)),\"\")","v":""},null,null,null,null,null,null,{"$f":"ROWS($C$2:$C5)","v":4},null,null,{"$f":"IFERROR(INDEX(w!F$2:F$421,MATCH(ROWS($C$2:$C2),$C$2:$C400,0)),\"\")","v":"مدیریت استراتژیک پیشرفته"},{"$f":"IFERROR(INDEX(w!G$2:G$421,MATCH(ROWS($C$2:$C2),$C$2:$C400,0)),\"\")","v":"3"},{"$f":"IFERROR(INDEX(w!I$2:I$421,MATCH(ROWS($C$2:$C2),$C$2:$C400,0)),\"\")","v":"حمیدی زاده"},{"$f":"IFERROR(INDEX(w!N$2:N$421,MATCH(ROWS($C$2:$C2),$C$2:$C400,0)),\"\")","v":"یکشنبه\nسه شنبه"},{"$f":"IFERROR(INDEX(w!O$2:O$421,MATCH(ROWS($C$2:$C2),$C$2:$C400,0)),\"\")","v":"15-17\n15-17"},{"$f":"IFERROR(INDEX(w!P$2:P$421,MATCH(ROWS($C$2:$C2),$C$2:$C400,0)),\"\")","v":"208\n-"},{"$f":"IFERROR(INDEX(w!R$2:R$421,MATCH(ROWS($C$2:$C2),$C$2:$C400,0)),\"\")","v":"99/04/04"},{"$f":"IFERROR(INDEX(w!S$2:S$421,MATCH(ROWS($C$2:$C2),$C$2:$C400,0)),\"\")","v":"8"},{"$f":"IFERROR(INDEX(w!AA$2:AA$421,MATCH(ROWS($C$2:$C2),$C$2:$C400,0)),\"\")","v":0},null,{"$f":"CONCATENATE(\"رشته: \",w!C5,\"-\",\" گرایش: \",w!D5,\" - \",w!B5,\" - دانشجویان \",w!K5,\" - \",w!E5)","v":"رشته: علوم اقتصادی- گرایش: برنامه ريزي سيستمهاي اقتصادي - كارشناسي ارشد - دانشجویان ترم 02 - روزانه"}]
["رشته: مهندسي صنايع- گرایش: سيستمهاي كلان - كارشناسي ارشد - دانشجویان ترم 02 - روزانه",0,{"$f":"IF(B6=1,+COUNTIF($B$2:$B6,1),\"\")","v":""},{"$f":"IFERROR(INDEX($X$2:$X$400,MATCH(ROWS($C$2:$C6),$C$2:$C404,0)),\"\")","v":""},null,null,null,null,null,null,{"$f":"ROWS($C$2:$C6)","v":5},null,null,{"$f":"IFERROR(INDEX(w!F$2:F$421,MATCH(ROWS($C$2:$C3),$C$2:$C401,0)),\"\")","v":"مدیریت اتحادهای اسراتژیک"},{"$f":"IFERROR(INDEX(w!G$2:G$421,MATCH(ROWS($C$2:$C3),$C$2:$C401,0)),\"\")","v":"3"},{"$f":"IFERROR(INDEX(w!I$2:I$421,MATCH(ROWS($C$2:$C3),$C$2:$C401,0)),\"\")","v":"علی احمدی"},{"$f":"IFERROR(INDEX(w!N$2:N$421,MATCH(ROWS($C$2:$C3),$C$2:$C401,0)),\"\")","v":"سه شنبه\n"},{"$f":"IFERROR(INDEX(w!O$2:O$421,MATCH(ROWS($C$2:$C3),$C$2:$C401,0)),\"\")","v":"7-10\n"},{"$f":"IFERROR(INDEX(w!P$2:P$421,MATCH(ROWS($C$2:$C3),$C$2:$C401,0)),\"\")","v":"213\n-"},{"$f":"IFERROR(INDEX(w!R$2:R$421,MATCH(ROWS($C$2:$C3),$C$2:$C401,0)),\"\")","v":"99/03/24"},{"$f":"IFERROR(INDEX(w!S$2:S$421,MATCH(ROWS($C$2:$C3),$C$2:$C401,0)),\"\")","v":10},{"$f":"IFERROR(INDEX(w!AA$2:AA$421,MATCH(ROWS($C$2:$C3),$C$2:$C401,0)),\"\")","v":0},null,{"$f":"CONCATENATE(\"رشته: \",w!C6,\"-\",\" گرایش: \",w!D6,\" - \",w!B6,\" - دانشجویان \",w!K6,\" - \",w!E6)","v":"رشته: علوم اقتصادی- گرایش: برنامه ريزي سيستمهاي اقتصادي - كارشناسي ارشد - دانشجویان ترم 04 و بیشتر - روزانه"}]
["رشته: مهندسي صنايع- گرایش: سيستمهاي كلان - كارشناسي ارشد - دانشجویان ترم 04 و بیشتر - روزانه",0,{"$f":"IF(B7=1,+COUNTIF($B$2:$B7,1),\"\")","v":""},{"$f":"IFERROR(INDEX($X$2:$X$400,MATCH(ROWS($C$2:$C7),$C$2:$C405,0)),\"\")","v":""},null,null,null,null,null,null,{"$f":"ROWS($C$2:$C7)","v":6},null,null,{"$f":"IFERROR(INDEX(w!F$2:F$421,MATCH(ROWS($C$2:$C4),$C$2:$C402,0)),\"\")","v":"مدیریت استراتژیک فناوری"},{"$f":"IFERROR(INDEX(w!G$2:G$421,MATCH(ROWS($C$2:$C4),$C$2:$C402,0)),\"\")","v":"3"},{"$f":"IFERROR(INDEX(w!I$2:I$421,MATCH(ROWS($C$2:$C4),$C$2:$C402,0)),\"\")","v":"ذاکری"},{"$f":"IFERROR(INDEX(w!N$2:N$421,MATCH(ROWS($C$2:$C4),$C$2:$C402,0)),\"\")","v":"یکشنبه\nسه شنبه"},{"$f":"IFERROR(INDEX(w!O$2:O$421,MATCH(ROWS($C$2:$C4),$C$2:$C402,0)),\"\")","v":"10-12\n10-12"},{"$f":"IFERROR(INDEX(w!P$2:P$421,MATCH(ROWS($C$2:$C4),$C$2:$C402,0)),\"\")","v":"\n-"},{"$f":"IFERROR(INDEX(w!R$2:R$421,MATCH(ROWS($C$2:$C4),$C$2:$C402,0)),\"\")","v":"99/03/26"},{"$f":"IFERROR(INDEX(w!S$2:S$421,MATCH(ROWS($C$2:$C4),$C$2:$C402,0)),\"\")","v":10},{"$f":"IFERROR(INDEX(w!AA$2:AA$421,MATCH(ROWS($C$2:$C4),$C$2:$C402,0)),\"\")","v":0},null,{"$f":"CONCATENATE(\"رشته: \",w!C7,\"-\",\" گرایش: \",w!D7,\" - \",w!B7,\" - دانشجویان \",w!K7,\" - \",w!E7)","v":"رشته: علوم اقتصادی- گرایش: توسعه اقتصادي و برنامه ريزي - كارشناسي ارشد - دانشجویان ترم 02 - روزانه"}]
["رشته: سياست گذاري علم و فناوري- گرایش: - - دكتري تخصصي - دانشجویان ترم 02 - روزانه و پردیس",0,{"$f":"IF(B8=1,+COUNTIF($B$2:$B8,1),\"\")","v":""},{"$f":"IFERROR(INDEX($X$2:$X$400,MATCH(ROWS($C$2:$C8),$C$2:$C406,0)),\"\")","v":""},null,null,null,null,null,null,{"$f":"ROWS($C$2:$C8)","v":7},null,null,{"$f":"IFERROR(INDEX(w!F$2:F$421,MATCH(ROWS($C$2:$C5),$C$2:$C403,0)),\"\")","v":""},{"$f":"IFERROR(INDEX(w!G$2:G$421,MATCH(ROWS($C$2:$C5),$C$2:$C403,0)),\"\")","v":""},{"$f":"IFERROR(INDEX(w!I$2:I$421,MATCH(ROWS($C$2:$C5),$C$2:$C403,0)),\"\")","v":""},{"$f":"IFERROR(INDEX(w!N$2:N$421,MATCH(ROWS($C$2:$C5),$C$2:$C403,0)),\"\")","v":""},{"$f":"IFERROR(INDEX(w!O$2:O$421,MATCH(ROWS($C$2:$C5),$C$2:$C403,0)),\"\")","v":""},{"$f":"IFERROR(INDEX(w!P$2:P$421,MATCH(ROWS($C$2:$C5),$C$2:$C403,0)),\"\")","v":""},{"$f":"IFERROR(INDEX(w!R$2:R$421,MATCH(ROWS($C$2:$C5),$C$2:$C403,0)),\"\")","v":""},{"$f":"IFERROR(INDEX(w!S$2:S$421,MATCH(ROWS($C$2:$C5),$C$2:$C403,0)),\"\")","v":""},{"$f":"IFERROR(INDEX(w!AA$2:AA$421,MATCH(ROWS($C$2:$C5),$C$2:$C403,0)),\"\")","v":""},null,{"$f":"CONCATENATE(\"رشته: \",w!C8,\"-\",\" گرایش: \",w!D8,\" - \",w!B8,\" - دانشجویان \",w!K8,\" - \",w!E8)","v":"رشته: علوم اقتصادی- گرایش: توسعه اقتصادي و برنامه ريزي - كارشناسي ارشد - دانشجویان ترم 02 - روزانه"}]
["رشته: كارآفريني- گرایش: كسب و كار جديد - كارشناسي ارشد - دانشجویان ترم 02 - روزانه",0,{"$f":"IF(B9=1,+COUNTIF($B$2:$B9,1),\"\")","v":""},{"$f":"IFERROR(INDEX($X$2:$X$400,MATCH(ROWS($C$2:$C9),$C$2:$C407,0)),\"\")","v":""},null,null,null,null,null,null,{"$f":"ROWS($C$2:$C9)","v":8},null,null,{"$f":"IFERROR(INDEX(w!F$2:F$421,MATCH(ROWS($C$2:$C6),$C$2:$C404,0)),\"\")","v":""},{"$f":"IFERROR(INDEX(w!G$2:G$421,MATCH(ROWS($C$2:$C6),$C$2:$C404,0)),\"\")","v":""},{"$f":"IFERROR(INDEX(w!I$2:I$421,MATCH(ROWS($C$2:$C6),$C$2:$C404,0)),\"\")","v":""},{"$f":"IFERROR(INDEX(w!N$2:N$421,MATCH(ROWS($C$2:$C6),$C$2:$C404,0)),\"\")","v":""},{"$f":"IFERROR(INDEX(w!O$2:O$421,MATCH(ROWS($C$2:$C6),$C$2:$C404,0)),\"\")","v":""},{"$f":"IFERROR(INDEX(w!P$2:P$421,MATCH(ROWS($C$2:$C6),$C$2:$C404,0)),\"\")","v":""},{"$f":"IFERROR(INDEX(w!R$2:R$421,MATCH(ROWS($C$2:$C6),$C$2:$C404,0)),\"\")","v":""},{"$f":"IFERROR(INDEX(w!S$2:S$421,MATCH(ROWS($C$2:$C6),$C$2:$C404,0)),\"\")","v":""},{"$f":"IFERROR(INDEX(w!AA$2:AA$421,MATCH(ROWS($C$2:$C6),$C$2:$C404,0)),\"\")","v":""},null,{"$f":"CONCATENATE(\"رشته: \",w!C9,\"-\",\" گرایش: \",w!D9,\" - \",w!B9,\" - دانشجویان \",w!K9,\" - \",w!E9)","v":"رشته: علوم اقتصادی- گرایش: توسعه اقتصادي و برنامه ريزي - كارشناسي ارشد - دانشجویان ترم 02 - روزانه"}]
["رشته: كارآفريني- گرایش: كسب و كار جديد - كارشناسي ارشد - دانشجویان ترم 04 - روزانه",0,{"$f":"IF(B10=1,+COUNTIF($B$2:$B10,1),\"\")","v":""},{"$f":"IFERROR(INDEX($X$2:$X$400,MATCH(ROWS($C$2:$C10),$C$2:$C408,0)),\"\")","v":""},null,null,null,null,null,null,{"$f":"ROWS($C$2:$C10)","v":9},null,null,{"$f":"IFERROR(INDEX(w!F$2:F$421,MATCH(ROWS($C$2:$C7),$C$2:$C405,0)),\"\")","v":""},{"$f":"IFERROR(INDEX(w!G$2:G$421,MATCH(ROWS($C$2:$C7),$C$2:$C405,0)),\"\")","v":""},{"$f":"IFERROR(INDEX(w!I$2:I$421,MATCH(ROWS($C$2:$C7),$C$2:$C405,0)),\"\")","v":""},{"$f":"IFERROR(INDEX(w!N$2:N$421,MATCH(ROWS($C$2:$C7),$C$2:$C405,0)),\"\")","v":""},{"$f":"IFERROR(INDEX(w!O$2:O$421,MATCH(ROWS($C$2:$C7),$C$2:$C405,0)),\"\")","v":""},{"$f":"IFERROR(INDEX(w!P$2:P$421,MATCH(ROWS($C$2:$C7),$C$2:$C405,0)),\"\")","v":""},{"$f":"IFERROR(INDEX(w!R$2:R$421,MATCH(ROWS($C$2:$C7),$C$2:$C405,0)),\"\")","v":""},{"$f":"IFERROR(INDEX(w!S$2:S$421,MATCH(ROWS($C$2:$C7),$C$2:$C405,0)),\"\")","v":""},{"$f":"IFERROR(INDEX(w!AA$2:AA$421,MATCH(ROWS($C$2:$C7),$C$2:$C405,0)),\"\")","v":""},null,{"$f":"CONCATENATE(\"رشته: \",w!C10,\"-\",\" گرایش: \",w!D10,\" - \",w!B10,\" - دانشجویان \",w!K10,\" - \",w!E10)","v":"رشته: علوم اقتصادی- گرایش: توسعه اقتصادي و برنامه ريزي - كارشناسي ارشد - دانشجویان ترم 04 و بیشتر - روزانه"}]
["رشته: كارآفريني- گرایش: كسب و كار جديد - كارشناسي ارشد - دانشجویان ترم 04 و بیشتر - روزانه",0,{"$f":"IF(B11=1,+COUNTIF($B$2:$B11,1),\"\")","v":""},{"$f":"IFERROR(INDEX($X$2:$X$400,MATCH(ROWS($C$2:$C11),$C$2:$C409,0)),\"\")","v":""},null,null,null,null,null,null,{"$f":"ROWS($C$2:$C11)","v":10},null,null,{"$f":"IFERROR(INDEX(w!F$2:F$421,MATCH(ROWS($C$2:$C8),$C$2:$C406,0)),\"\")","v":""},{"$f":"IFERROR(INDEX(w!G$2:G$421,MATCH(ROWS($C$2:$C8),$C$2:$C406,0)),\"\")","v":""},{"$f":"IFERROR(INDEX(w!I$2:I$421,MATCH(ROWS($C$2:$C8),$C$2:$C406,0)),\"\")","v":""},{"$f":"IFERROR(INDEX(w!N$2:N$421,MATCH(ROWS($C$2:$C8),$C$2:$C406,0)),\"\")","v":""},{"$f":"IFERROR(INDEX(w!O$2:O$421,MATCH(ROWS($C$2:$C8),$C$2:$C406,0)),\"\")","v":""},{"$f":"IFERROR(INDEX(w!P$2:P$421,MATCH(ROWS($C$2:$C8),$C$2:$C406,0)),\"\")","v":""},{"$f":"IFERROR(INDEX(w!R$2:R$421,MATCH(ROWS($C$2:$C8),$C$2:$C406,0)),\"\")","v":""},{"$f":"IFERROR(INDEX(w!S$2:S$421,MATCH(ROWS($C$2:$C8),$C$2:$C406,0)),\"\")","v":""},{"$f":"IFERROR(INDEX(w!AA$2:AA$421,MATCH(ROWS($C$2:$C8),$C$2:$C406,0)),\"\")","v":""},null,{"$f":"CONCATENATE(\"رشته: \",w!C11,\"-\",\" گرایش: \",w!D11,\" - \",w!B11,\" - دانشجویان \",w!K11,\" - \",w!E11)","v":"رشته: مهندسي صنايع- گرایش: سيستمهاي كلان - كارشناسي ارشد - دانشجویان ترم 02 - روزانه"}]
["رشته: مديريت فناوري اطلاعات- گرایش: كسب و كار الكترونيك - كارشناسي ارشد - دانشجویان ترم 02 - پردیس",0,{"$f":"IF(B12=1,+COUNTIF($B$2:$B12,1),\"\")","v":""},{"$f":"IFERROR(INDEX($X$2:$X$400,MATCH(ROWS($C$2:$C12),$C$2:$C410,0)),\"\")","v":""},null,null,null,null,null,null,{"$f":"ROWS($C$2:$C12)","v":11},null,null,null,null,null,null,null,null,null,null,null,null,{"$f":"CONCATENATE(\"رشته: \",w!C12,\"-\",\" گرایش: \",w!D12,\" - \",w!B12,\" - دانشجویان \",w!K12,\" - \",w!E12)","v":"رشته: مهندسي صنايع- گرایش: سيستمهاي كلان - كارشناسي ارشد - دانشجویان ترم 02 - روزانه"}]
["رشته: مديريت فناوري اطلاعات- گرایش: كسب و كار الكترونيك - كارشناسي ارشد - دانشجویان ترم 02 - روزانه",0,{"$f":"IF(B13=1,+COUNTIF($B$2:$B13,1),\"\")","v":""},{"$f":"IFERROR(INDEX($X$2:$X$400,MATCH(ROWS($C$2:$C13),$C$2:$C411,0)),\"\")","v":""},null,null,null,null,null,null,{"$f":"ROWS($C$2:$C13)","v":12},null,null,null,null,null,null,null,null,null,null,null,null,{"$f":"CONCATENATE(\"رشته: \",w!C13,\"-\",\" گرایش: \",w!D13,\" - \",w!B13,\" - دانشجویان \",w!K13,\" - \",w!E13)","v":"رشته: مهندسي صنايع- گرایش: سيستمهاي كلان - كارشناسي ارشد - دانشجویان ترم 02 - روزانه"}]
["رشته: مديريت فناوري اطلاعات- گرایش: كسب و كار الكترونيك - كارشناسي ارشد - دانشجویان ترم 04 و بیشتر - پردیس",0,{"$f":"IF(B14=1,+COUNTIF($B$2:$B14,1),\"\")","v":""},{"$f":"IFERROR(INDEX($X$2:$X$400,MATCH(ROWS($C$2:$C14),$C$2:$C412,0)),\"\")","v":""},null,null,null,null,null,null,{"$f":"ROWS($C$2:$C14)","v":13},null,null,null,null,null,null,null,null,null,null,null,null,{"$f":"CONCATENATE(\"رشته: \",w!C14,\"-\",\" گرایش: \",w!D14,\" - \",w!B14,\" - دانشجویان \",w!K14,\" - \",w!E14)","v":"رشته: مهندسي صنايع- گرایش: سيستمهاي كلان - كارشناسي ارشد - دانشجویان ترم 02 - روزانه"}]
["رشته: مديريت فناوري اطلاعات- گرایش: كسب و كار الكترونيك - كارشناسي ارشد - دانشجویان ترم 04 و بیشتر - روزانه",0,{"$f":"IF(B15=1,+COUNTIF($B$2:$B15,1),\"\")","v":""},{"$f":"IFERROR(INDEX($X$2:$X$400,MATCH(ROWS($C$2:$C15),$C$2:$C413,0)),\"\")","v":""},null,null,null,null,null,null,{"$f":"ROWS($C$2:$C15)","v":14},null,null,null,null,null,null,null,null,null,null,null,null,{"$f":"CONCATENATE(\"رشته: \",w!C15,\"-\",\" گرایش: \",w!D15,\" - \",w!B15,\" - دانشجویان \",w!K15,\" - \",w!E15)","v":"رشته: مهندسي صنايع- گرایش: سيستمهاي كلان - كارشناسي ارشد - دانشجویان ترم 04 و بیشتر - روزانه"}]
["رشته: مديريت تكنولوژي- گرایش: نوآوري تكنولوژي - سياست هاي تحقيق و توسعه - كارشناسي ارشد - دانشجویان ترم 02 - روزانه",0,{"$f":"IF(B16=1,+COUNTIF($B$2:$B16,1),\"\")","v":""},{"$f":"IFERROR(INDEX($X$2:$X$400,MATCH(ROWS($C$2:$C16),$C$2:$C414,0)),\"\")","v":""},null,null,null,null,null,null,{"$f":"ROWS($C$2:$C16)","v":15},null,null,null,null,null,null,null,null,null,null,null,null,{"$f":"CONCATENATE(\"رشته: \",w!C16,\"-\",\" گرایش: \",w!D16,\" - \",w!B16,\" - دانشجویان \",w!K16,\" - \",w!E16)","v":"رشته: سياست گذاري علم و فناوري- گرایش: - - دكتري تخصصي - دانشجویان ترم 02 - روزانه و پردیس"}]
["رشته: مديريت تكنولوژي- گرایش: نوآوري تكنولوژي - سياست هاي تحقيق و توسعه - كارشناسي ارشد - دانشجویان ترم 04 و بیشتر - روزانه",0,{"$f":"IF(B17=1,+COUNTIF($B$2:$B17,1),\"\")","v":""},{"$f":"IFERROR(INDEX($X$2:$X$400,MATCH(ROWS($C$2:$C17),$C$2:$C415,0)),\"\")","v":""},null,null,null,null,null,null,{"$f":"ROWS($C$2:$C17)","v":16},null,null,null,null,null,null,null,null,null,null,null,null,{"$f":"CONCATENATE(\"رشته: \",w!C17,\"-\",\" گرایش: \",w!D17,\" - \",w!B17,\" - دانشجویان \",w!K17,\" - \",w!E17)","v":"رشته: سياست گذاري علم و فناوري- گرایش: - - دكتري تخصصي - دانشجویان ترم 02 - روزانه و پردیس"}]
["رشته: مديريت تكنولوژي- گرایش: مديريت نوآوري - دكتري تخصصي - دانشجویان ترم 02 - روزانه و پردیس",0,{"$f":"IF(B18=1,+COUNTIF($B$2:$B18,1),\"\")","v":""},{"$f":"IFERROR(INDEX($X$2:$X$400,MATCH(ROWS($C$2:$C18),$C$2:$C416,0)),\"\")","v":""},null,null,null,null,null,null,{"$f":"ROWS($C$2:$C18)","v":17},null,null,null,null,null,null,null,null,null,null,null,null,{"$f":"CONCATENATE(\"رشته: \",w!C18,\"-\",\" گرایش: \",w!D18,\" - \",w!B18,\" - دانشجویان \",w!K18,\" - \",w!E18)","v":"رشته: سياست گذاري علم و فناوري- گرایش: - - دكتري تخصصي - دانشجویان ترم 02 - روزانه و پردیس"}]
["رشته: مديريت سازمان هاي دولتي ايران- گرایش: سياستگذاري دولتي(خط مشي گذاري عمومي) - دكتري تخصصي - دانشجویان ترم 02 - روزانه و پردیس",0,{"$f":"IF(B19=1,+COUNTIF($B$2:$B19,1),\"\")","v":""},{"$f":"IFERROR(INDEX($X$2:$X$400,MATCH(ROWS($C$2:$C19),$C$2:$C417,0)),\"\")","v":""},null,null,null,null,null,null,{"$f":"ROWS($C$2:$C19)","v":18},null,null,null,null,null,null,null,null,null,null,null,null,{"$f":"CONCATENATE(\"رشته: \",w!C19,\"-\",\" گرایش: \",w!D19,\" - \",w!B19,\" - دانشجویان \",w!K19,\" - \",w!E19)","v":"رشته: سياست گذاري علم و فناوري- گرایش: - - دكتري تخصصي - دانشجویان ترم 02 - روزانه و پردیس"}]
["رشته: مديريت كسب و كار- گرایش: بازاريابي - استراتژي - كارشناسي ارشد - دانشجویان ترم 02 - پردیس",0,{"$f":"IF(B20=1,+COUNTIF($B$2:$B20,1),\"\")","v":""},{"$f":"IFERROR(INDEX($X$2:$X$400,MATCH(ROWS($C$2:$C20),$C$2:$C418,0)),\"\")","v":""},null,null,null,null,null,null,{"$f":"ROWS($C$2:$C20)","v":19},null,null,null,null,null,null,null,null,null,null,null,null,{"$f":"CONCATENATE(\"رشته: \",w!C20,\"-\",\" گرایش: \",w!D20,\" - \",w!B20,\" - دانشجویان \",w!K20,\" - \",w!E20)","v":"رشته: سياست گذاري علم و فناوري- گرایش: - - دكتري تخصصي - دانشجویان ترم 02 - روزانه و پردیس"}]
["رشته: مديريت كسب و كار- گرایش: بازاريابي - استراتژي - كارشناسي ارشد - دانشجویان ترم 02 - روزانه",0,{"$f":"IF(B21=1,+COUNTIF($B$2:$B21,1),\"\")","v":""},{"$f":"IFERROR(INDEX($X$2:$X$400,MATCH(ROWS($C$2:$C21),$C$2:$C419,0)),\"\")","v":""},null,null,null,null,null,null,null,null,null,null,null,null,null,null,null,null,null,null,null,{"$f":"CONCATENATE(\"رشته: \",w!C21,\"-\",\" گرایش: \",w!D21,\" - \",w!B21,\" - دانشجویان \",w!K21,\" - \",w!E21)","v":"رشته: سياست گذاري علم و فناوري- گرایش: - - دكتري تخصصي - دانشجویان ترم 02 - روزانه و پردیس"}]
["رشته: مديريت كسب و كار- گرایش: بازاريابي - استراتژي - كارشناسي ارشد - دانشجویان ترم 04 - روزانه",0,{"$f":"IF(B22=1,+COUNTIF($B$2:$B22,1),\"\")","v":""},{"$f":"IFERROR(INDEX($X$2:$X$400,MATCH(ROWS($C$2:$C22),$C$2:$C420,0)),\"\")","v":""},null,null,null,null,null,null,null,null,null,null,null,null,null,null,null,null,null,null,null,{"$f":"CONCATENATE(\"رشته: \",w!C22,\"-\",\" گرایش: \",w!D22,\" - \",w!B22,\" - دانشجویان \",w!K22,\" - \",w!E22)","v":"رشته: كارآفريني- گرایش: كسب و كار جديد - كارشناسي ارشد - دانشجویان ترم 02 - روزانه"}]
["رشته: مديريت كسب و كار- گرایش: بازاريابي - كارشناسي ارشد - دانشجویان ترم 04 - روزانه",0,{"$f":"IF(B23=1,+COUNTIF($B$2:$B23,1),\"\")","v":""},{"$f":"IFERROR(INDEX($X$2:$X$400,MATCH(ROWS($C$2:$C23),$C$2:$C421,0)),\"\")","v":""},null,null,null,null,null,null,null,null,null,null,null,null,null,null,null,null,null,null,null,{"$f":"CONCATENATE(\"رشته: \",w!C23,\"-\",\" گرایش: \",w!D23,\" - \",w!B23,\" - دانشجویان \",w!K23,\" - \",w!E23)","v":"رشته: كارآفريني- گرایش: كسب و كار جديد - كارشناسي ارشد - دانشجویان ترم 02 - روزانه"}]
["رشته: مديريت كسب و كار- گرایش: بازاريابي - كارشناسي ارشد - دانشجویان ترم 04 - پردیس",0,{"$f":"IF(B24=1,+COUNTIF($B$2:$B24,1),\"\")","v":""},{"$f":"IFERROR(INDEX($X$2:$X$400,MATCH(ROWS($C$2:$C24),$C$2:$C422,0)),\"\")","v":""},null,null,null,null,null,null,null,null,null,null,null,null,null,null,null,null,null,null,null,{"$f":"CONCATENATE(\"رشته: \",w!C24,\"-\",\" گرایش: \",w!D24,\" - \",w!B24,\" - دانشجویان \",w!K24,\" - \",w!E24)","v":"رشته: كارآفريني- گرایش: كسب و كار جديد - كارشناسي ارشد - دانشجویان ترم 02 - روزانه"}]
["رشته: مديريت كسب و كار- گرایش: بازاريابي - استراتژي - كارشناسي ارشد - دانشجویان ترم 04 - پردیس",0,{"$f":"IF(B25=1,+COUNTIF($B$2:$B25,1),\"\")","v":""},{"$f":"IFERROR(INDEX($X$2:$X$400,MATCH(ROWS($C$2:$C25),$C$2:$C423,0)),\"\")","v":""},null,null,null,null,null,null,null,null,null,null,null,null,null,null,null,null,null,null,null,{"$f":"CONCATENATE(\"رشته: \",w!C25,\"-\",\" گرایش: \",w!D25,\" - \",w!B25,\" - دانشجویان \",w!K25,\" - \",w!E25)","v":"رشته: كارآفريني- گرایش: كسب و كار جديد - كارشناسي ارشد - دانشجویان ترم 02 - روزانه"}]
["رشته: مديريت كسب و كار- گرایش: استراتژي - كارشناسي ارشد - دانشجویان ترم 04 - پردیس",0,{"$f":"IF(B26=1,+COUNTIF($B$2:$B26,1),\"\")","v":""},{"$f":"IFERROR(INDEX($X$2:$X$400,MATCH(ROWS($C$2:$C26),$C$2:$C424,0)),\"\")","v":""},null,null,null,null,null,null,null,null,null,null,null,null,null,null,null,null,null,null,null,{"$f":"CONCATENATE(\"رشته: \",w!C26,\"-\",\" گرایش: \",w!D26,\" - \",w!B26,\" - دانشجویان \",w!K26,\" - \",w!E26)","v":"رشته: كارآفريني- گرایش: كسب و كار جديد - كارشناسي ارشد - دانشجویان ترم 02 - روزانه"}]
["رشته: مديريت كسب و كار- گرایش: استراتژي - كارشناسي ارشد - دانشجویان ترم 04 - روزانه",0,{"$f":"IF(B27=1,+COUNTIF($B$2:$B27,1),\"\")","v":""},{"$f":"IFERROR(INDEX($X$2:$X$400,MATCH(ROWS($C$2:$C27),$C$2:$C425,0)),\"\")","v":""},null,null,null,null,null,null,null,null,null,null,null,null,null,null,null,null,null,null,null,{"$f":"CONCATENATE(\"رشته: \",w!C27,\"-\",\" گرایش: \",w!D27,\" - \",w!B27,\" - دانشجویان \",w!K27,\" - \",w!E27)","v":"رشته: كارآفريني- گرایش: كسب و كار جديد - كارشناسي ارشد - دانشجویان ترم 02 - روزانه"}]
["رشته: مديريت كسب و كار- گرایش: بازاريابي - استراتژي - كارشناسي ارشد - دانشجویان ترم 04 و بیشتر - پردیس",0,{"$f":"IF(B28=1,+COUNTIF($B$2:$B28,1),\"\")","v":""},{"$f":"IFERROR(INDEX($X$2:$X$400,MATCH(ROWS($C$2:$C28),$C$2:$C426,0)),\"\")","v":""},null,null,null,null,null,null,null,null,null,null,null,null,null,null,null,null,null,null,null,{"$f":"CONCATENATE(\"رشته: \",w!C28,\"-\",\" گرایش: \",w!D28,\" - \",w!B28,\" - دانشجویان \",w!K28,\" - \",w!E28)","v":"رشته: كارآفريني- گرایش: كسب و كار جديد - كارشناسي ارشد - دانشجویان ترم 04 - روزانه"}]
["رشته: مديريت كسب و كار- گرایش: بازاريابي - استراتژي - كارشناسي ارشد - دانشجویان ترم 04 و بیشتر - روزانه",0,{"$f":"IF(B29=1,+COUNTIF($B$2:$B29,1),\"\")","v":""},{"$f":"IFERROR(INDEX($X$2:$X$400,MATCH(ROWS($C$2:$C29),$C$2:$C427,0)),\"\")","v":""},null,null,null,null,null,null,null,null,null,null,null,null,null,null,null,null,null,null,null,{"$f":"CONCATENATE(\"رشته: \",w!C29,\"-\",\" گرایش: \",w!D29,\" - \",w!B29,\" - دانشجویان \",w!K29,\" - \",w!E29)","v":"رشته: كارآفريني- گرایش: كسب و كار جديد - كارشناسي ارشد - دانشجویان ترم 04 و بیشتر - روزانه"}]
[null,0,{"$f":"IF(B30=1,+COUNTIF($B$2:$B30,1),\"\")","v":""},{"$f":"IFERROR(INDEX($X$2:$X$400,MATCH(ROWS($C$2:$C30),$C$2:$C428,0)),\"\")","v":""},null,null,null,null,null,null,null,null,null,null,null,null,null,null,null,null,null,null,null,{"$f":"CONCATENATE(\"رشته: \",w!C30,\"-\",\" گرایش: \",w!D30,\" - \",w!B30,\" - دانشجویان \",w!K30,\" - \",w!E30)","v":"رشته: مديريت فناوري اطلاعات- گرایش: كسب و كار الكترونيك - كارشناسي ارشد - دانشجویان ترم 02 - پردیس"}]
[null,0,{"$f":"IF(B31=1,+COUNTIF($B$2:$B31,1),\"\")","v":""},{"$f":"IFERROR(INDEX($X$2:$X$400,MATCH(ROWS($C$2:$C31),$C$2:$C429,0)),\"\")","v":""},null,null,null,null,null,null,null,null,null,null,null,null,null,null,null,null,null,null,null,{"$f":"CONCATENATE(\"رشته: \",w!C31,\"-\",\" گرایش: \",w!D31,\" - \",w!B31,\" - دانشجویان \",w!K31,\" - \",w!E31)","v":"رشته: مديريت فناوري اطلاعات- گرایش: كسب و كار الكترونيك - كارشناسي ارشد - دانشجویان ترم 02 - روزانه"}]
[null,0,{"$f":"IF(B32=1,+COUNTIF($B$2:$B32,1),\"\")","v":""},{"$f":"IFERROR(INDEX($X$2:$X$400,MATCH(ROWS($C$2:$C32),$C$2:$C430,0)),\"\")","v":""},null,null,null,null,null,null,null,null,null,null,null,null,null,null,null,null,null,null,null,{"$f":"CONCATENATE(\"رشته: \",w!C32,\"-\",\" گرایش: \",w!D32,\" - \",w!B32,\" - دانشجویان \",w!K32,\" - \",w!E32)","v":"رشته: مديريت فناوري اطلاعات- گرایش: كسب و كار الكترونيك - كارشناسي ارشد - دانشجویان ترم 02 - پردیس"}]
[null,0,{"$f":"IF(B33=1,+COUNTIF($B$2:$B33,1),\"\")","v":""},{"$f":"IFERROR(INDEX($X$2:$X$400,MATCH(ROWS($C$2:$C33),$C$2:$C431,0)),\"\")","v":""},null,null,null,null,null,null,null,null,null,null,null,null,null,null,null,null,null,null,null,{"$f":"CONCATENATE(\"رشته: \",w!C33,\"-\",\" گرایش: \",w!D33,\" - \",w!B33,\" - دانشجویان \",w!K33,\" - \",w!E33)","v":"رشته: مديريت فناوري اطلاعات- گرایش: كسب و كار الكترونيك - كارشناسي ارشد - دانشجویان ترم 02 - روزانه"}]
[null,0,{"$f":"IF(B34=1,+COUNTIF($B$2:$B34,1),\"\")","v":""},{"$f":"IFERROR(INDEX($X$2:$X$400,MATCH(ROWS($C$2:$C34),$C$2:$C432,0)),\"\")","v":""},null,null,null,null,null,null,null,null,null,null,null,null,null,null,null,null,null,null,null,{"$f":"CONCATENATE(\"رشته: \",w!C34,\"-\",\" گرایش: \",w!D34,\" - \",w!B34,\" - دانشجویان \",w!K34,\" - \",w!E34)","v":"رشته: مديريت فناوري اطلاعات- گرایش: كسب و كار الكترونيك - كارشناسي ارشد - دانشجویان ترم 02 - پردیس"}]
[null,0,{"$f":"IF(B35=1,+COUNTIF($B$2:$B35,1),\"\")","v":""},{"$f":"IFERROR(INDEX($X$2:$X$400,MATCH(ROWS($C$2:$C35),$C$2:$C433,0)),\"\")","v":""},null,null,null,null,null,null,null,null,null,null,null,null,null,null,null,null,null,null,null,{"$f":"CONCATENATE(\"رشته: \",w!C35,\"-\",\" گرایش: \",w!D35,\" - \",w!B35,\" - دانشجویان \",w!K35,\" - \",w!E35)","v":"رشته: مديريت فناوري اطلاعات- گرایش: كسب و كار الكترونيك - كارشناسي ارشد - دانشجویان ترم 02 - روزانه"}]
[null,0,{"$f":"IF(B36=1,+COUNTIF($B$2:$B36,1),\"\")","v":""},{"$f":"IFERROR(INDEX($X$2:$X$400,MATCH(ROWS($C$2:$C36),$C$2:$C434,0)),\"\")","v":""},null,null,null,null,null,null,null,null,null,null,null,null,null,null,null,null,null,null,null,{"$f":"CONCATENATE(\"رشته: \",w!C36,\"-\",\" گرایش: \",w!D36,\" - \",w!B36,\" - دانشجویان \",w!K36,\" - \",w!E36)","v":"رشته: مديريت فناوري اطلاعات- گرایش: كسب و كار الكترونيك - كارشناسي ارشد - دانشجویان ترم 02 - پردیس"}]
[null,0,{"$f":"IF(B37=1,+COUNTIF($B$2:$B37,1),\"\")","v":""},{"$f":"IFERROR(INDEX($X$2:$X$400,MATCH(ROWS($C$2:$C37),$C$2:$C435,0)),\"\")","v":""},null,null,null,null,null,null,null,null,null,null,null,null,null,null,null,null,null,null,null,{"$f":"CONCATENATE(\"رشته: \",w!C37,\"-\",\" گرایش: \",w!D37,\" - \",w!B37,\" - دانشجویان \",w!K37,\" - \",w!E37)","v":"رشته: مديريت فناوري اطلاعات- گرایش: كسب و كار الكترونيك - كارشناسي ارشد - دانشجویان ترم 02 - روزانه"}]
[null,0,{"$f":"IF(B38=1,+COUNTIF($B$2:$B38,1),\"\")","v":""},{"$f":"IFERROR(INDEX($X$2:$X$400,MATCH(ROWS($C$2:$C38),$C$2:$C436,0)),\"\")","v":""},null,null,null,null,null,null,null,null,null,null,null,null,null,null,null,null,null,null,null,{"$f":"CONCATENATE(\"رشته: \",w!C38,\"-\",\" گرایش: \",w!D38,\" - \",w!B38,\" - دانشجویان \",w!K38,\" - \",w!E38)","v":"رشته: مديريت فناوري اطلاعات- گرایش: كسب و كار الكترونيك - كارشناسي ارشد - دانشجویان ترم 02 - پردیس"}]
[null,0,{"$f":"IF(B39=1,+COUNTIF($B$2:$B39,1),\"\")","v":""},{"$f":"IFERROR(INDEX($X$2:$X$400,MATCH(ROWS($C$2:$C39),$C$2:$C437,0)),\"\")","v":""},null,null,null,null,null,null,null,null,null,null,null,null,null,null,null,null,null,null,null,{"$f":"CONCATENATE(\"رشته: \",w!C39,\"-\",\" گرایش: \",w!D39,\" - \",w!B39,\" - دانشجویان \",w!K39,\" - \",w!E39)","v":"رشته: مديريت فناوري اطلاعات- گرایش: كسب و كار الكترونيك - كارشناسي ارشد - دانشجویان ترم 02 - روزانه"}]
[null,0,{"$f":"IF(B40=1,+COUNTIF($B$2:$B40,1),\"\")","v":""},{"$f":"IFERROR(INDEX($X$2:$X$400,MATCH(ROWS($C$2:$C40),$C$2:$C438,0)),\"\")","v":""},null,null,null,null,null,null,null,null,null,null,null,null,null,null,null,null,null,null,null,{"$f":"CONCATENATE(\"رشته: \",w!C40,\"-\",\" گرایش: \",w!D40,\" - \",w!B40,\" - دانشجویان \",w!K40,\" - \",w!E40)","v":"رشته: مديريت فناوري اطلاعات- گرایش: كسب و كار الكترونيك - كارشناسي ارشد - دانشجویان ترم 04 و بیشتر - پردیس"}]
[null,0,{"$f":"IF(B41=1,+COUNTIF($B$2:$B41,1),\"\")","v":""},{"$f":"IFERROR(INDEX($X$2:$X$400,MATCH(ROWS($C$2:$C41),$C$2:$C439,0)),\"\")","v":""},null,null,null,null,null,null,null,null,null,null,null,null,null,null,null,null,null,null,null,{"$f":"CONCATENATE(\"رشته: \",w!C41,\"-\",\" گرایش: \",w!D41,\" - \",w!B41,\" - دانشجویان \",w!K41,\" - \",w!E41)","v":"رشته: مديريت فناوري اطلاعات- گرایش: كسب و كار الكترونيك - كارشناسي ارشد - دانشجویان ترم 04 و بیشتر - روزانه"}]
[null,0,{"$f":"IF(B42=1,+COUNTIF($B$2:$B42,1),\"\")","v":""},{"$f":"IFERROR(INDEX($X$2:$X$400,MATCH(ROWS($C$2:$C42),$C$2:$C440,0)),\"\")","v":""},null,null,null,null,null,null,null,null,null,null,null,null,null,null,null,null,null,null,null,{"$f":"CONCATENATE(\"رشته: \",w!C42,\"-\",\" گرایش: \",w!D42,\" - \",w!B42,\" - دانشجویان \",w!K42,\" - \",w!E42)","v":"رشته: مديريت تكنولوژي- گرایش: نوآوري تكنولوژي - سياست هاي تحقيق و توسعه - كارشناسي ارشد - دانشجویان ترم 02 - روزانه"}]
[null,0,{"$f":"IF(B43=1,+COUNTIF($B$2:$B43,1),\"\")","v":""},{"$f":"IFERROR(INDEX($X$2:$X$400,MATCH(ROWS($C$2:$C43),$C$2:$C441,0)),\"\")","v":""},null,null,null,null,null,null,null,null,null,null,null,null,null,null,null,null,null,null,null,{"$f":"CONCATENATE(\"رشته: \",w!C43,\"-\",\" گرایش: \",w!D43,\" - \",w!B43,\" - دانشجویان \",w!K43,\" - \",w!E43)","v":"رشته: مديريت تكنولوژي- گرایش: نوآوري تكنولوژي - سياست هاي تحقيق و توسعه - كارشناسي ارشد - دانشجویان ترم 02 - روزانه"}]
[null,0,{"$f":"IF(B44=1,+COUNTIF($B$2:$B44,1),\"\")","v":""},{"$f":"IFERROR(INDEX($X$2:$X$400,MATCH(ROWS($C$2:$C44),$C$2:$C442,0)),\"\")","v":""},null,null,null,null,null,null,null,null,null,null,null,null,null,null,null,null,null,null,null,{"$f":"CONCATENATE(\"رشته: \",w!C44,\"-\",\" گرایش: \",w!D44,\" - \",w!B44,\" - دانشجویان \",w!K44,\" - \",w!E44)","v":"رشته: مديريت تكنولوژي- گرایش: نوآوري تكنولوژي - سياست هاي تحقيق و توسعه - كارشناسي ارشد - دانشجویان ترم 02 - روزانه"}]
[null,0,{"$f":"IF(B45=1,+COUNTIF($B$2:$B45,1),\"\")","v":""},{"$f":"IFERROR(INDEX($X$2:$X$400,MATCH(ROWS($C$2:$C45),$C$2:$C443,0)),\"\")","v":""},null,null,null,null,null,null,null,null,null,null,null,null,null,null,null,null,null,null,null,{"$f":"CONCATENATE(\"رشته: \",w!C45,\"-\",\" گرایش: \",w!D45,\" - \",w!B45,\" - دانشجویان \",w!K45,\" - \",w!E45)","v":"رشته: مديريت تكنولوژي- گرایش: نوآوري تكنولوژي - سياست هاي تحقيق و توسعه - كارشناسي ارشد - دانشجویان ترم 02 - روزانه"}]
[null,0,{"$f":"IF(B46=1,+COUNTIF($B$2:$B46,1),\"\")","v":""},{"$f":"IFERROR(INDEX($X$2:$X$400,MATCH(ROWS($C$2:$C46),$C$2:$C444,0)),\"\")","v":""},null,null,null,null,null,null,null,null,null,null,null,null,null,null,null,null,null,null,null,{"$f":"CONCATENATE(\"رشته: \",w!C46,\"-\",\" گرایش: \",w!D46,\" - \",w!B46,\" - دانشجویان \",w!K46,\" - \",w!E46)","v":"رشته: مديريت تكنولوژي- گرایش: نوآوري تكنولوژي - سياست هاي تحقيق و توسعه - كارشناسي ارشد - دانشجویان ترم 02 - روزانه"}]
[null,0,{"$f":"IF(B47=1,+COUNTIF($B$2:$B47,1),\"\")","v":""},{"$f":"IFERROR(INDEX($X$2:$X$400,MATCH(ROWS($C$2:$C47),$C$2:$C445,0)),\"\")","v":""},null,null,null,null,null,null,null,null,null,null,null,null,null,null,null,null,null,null,null,{"$f":"CONCATENATE(\"رشته: \",w!C47,\"-\",\" گرایش: \",w!D47,\" - \",w!B47,\" - دانشجویان \",w!K47,\" - \",w!E47)","v":"رشته: مديريت تكنولوژي- گرایش: نوآوري تكنولوژي - سياست هاي تحقيق و توسعه - كارشناسي ارشد - دانشجویان ترم 04 و بیشتر - روزانه"}]
[null,0,{"$f":"IF(B48=1,+COUNTIF($B$2:$B48,1),\"\")","v":""},{"$f":"IFERROR(INDEX($X$2:$X$400,MATCH(ROWS($C$2:$C48),$C$2:$C446,0)),\"\")","v":""},null,null,null,null,null,null,null,null,null,null,null,null,null,null,null,null,null,null,null,{"$f":"CONCATENATE(\"رشته: \",w!C48,\"-\",\" گرایش: \",w!D48,\" - \",w!B48,\" - دانشجویان \",w!K48,\" - \",w!E48)","v":"رشته: مديريت تكنولوژي- گرایش: مديريت نوآوري - دكتري تخصصي - دانشجویان ترم 02 - روزانه و پردیس"}]
[null,0,{"$f":"IF(B49=1,+COUNTIF($B$2:$B49,1),\"\")","v":""},{"$f":"IFERROR(INDEX($X$2:$X$400,MATCH(ROWS($C$2:$C49),$C$2:$C447,0)),\"\")","v":""},null,null,null,null,null,null,null,null,null,null,null,null,null,null,null,null,null,null,null,{"$f":"CONCATENATE(\"رشته: \",w!C49,\"-\",\" گرایش: \",w!D49,\" - \",w!B49,\" - دانشجویان \",w!K49,\" - \",w!E49)","v":"رشته: مديريت تكنولوژي- گرایش: مديريت نوآوري - دكتري تخصصي - دانشجویان ترم 02 - روزانه و پردیس"}]
[null,0,{"$f":"IF(B50=1,+COUNTIF($B$2:$B50,1),\"\")","v":""},{"$f":"IFERROR(INDEX($X$2:$X$400,MATCH(ROWS($C$2:$C50),$C$2:$C448,0)),\"\")","v":""},null,null,null,null,null,null,null,null,null,null,null,null,null,null,null,null,null,null,null,{"$f":"CONCATENATE(\"رشته: \",w!C50,\"-\",\" گرایش: \",w!D50,\" - \",w!B50,\" - دانشجویان \",w!K50,\" - \",w!E50)","v":"رشته: مديريت تكنولوژي- گرایش: مديريت نوآوري - دكتري تخصصي - دانشجویان ترم 02 - روزانه و پردیس"}]
[null,0,{"$f":"IF(B51=1,+COUNTIF($B$2:$B51,1),\"\")","v":""},{"$f":"IFERROR(INDEX($X$2:$X$400,MATCH(ROWS($C$2:$C51),$C$2:$C449,0)),\"\")","v":""},null,null,null,null,null,null,null,null,null,null,null,null,null,null,null,null,null,null,null,{"$f":"CONCATENATE(\"رشته: \",w!C51,\"-\",\" گرایش: \",w!D51,\" - \",w!B51,\" - دانشجویان \",w!K51,\" - \",w!E51)","v":"رشته: مديريت تكنولوژي- گرایش: مديريت نوآوري - دكتري تخصصي - دانشجویان ترم 02 - روزانه و پردیس"}]
[null,0,{"$f":"IF(B52=1,+COUNTIF($B$2:$B52,1),\"\")","v":""},{"$f":"IFERROR(INDEX($X$2:$X$400,MATCH(ROWS($C$2:$C52),$C$2:$C450,0)),\"\")","v":""},null,null,null,null,null,null,null,null,null,null,null,null,null,null,null,null,null,null,null,{"$f":"CONCATENATE(\"رشته: \",w!C52,\"-\",\" گرایش: \",w!D52,\" - \",w!B52,\" - دانشجویان \",w!K52,\" - \",w!E52)","v":"رشته: مديريت تكنولوژي- گرایش: مديريت نوآوري - دكتري تخصصي - دانشجویان ترم 02 - روزانه و پردیس"}]
[null,0,{"$f":"IF(B53=1,+COUNTIF($B$2:$B53,1),\"\")","v":""},{"$f":"IFERROR(INDEX($X$2:$X$400,MATCH(ROWS($C$2:$C53),$C$2:$C451,0)),\"\")","v":""},null,null,null,null,null,null,null,null,null,null,null,null,null,null,null,null,null,null,null,{"$f":"CONCATENATE(\"رشته: \",w!C53,\"-\",\" گرایش: \",w!D53,\" - \",w!B53,\" - دانشجویان \",w!K53,\" - \",w!E53)","v":"رشته: مديريت سازمان هاي دولتي ايران- گرایش: سياستگذاري دولتي(خط مشي گذاري عمومي) - دكتري تخصصي - دانشجویان ترم 02 - روزانه و پردیس"}]
[null,0,{"$f":"IF(B54=1,+COUNTIF($B$2:$B54,1),\"\")","v":""},{"$f":"IFERROR(INDEX($X$2:$X$400,MATCH(ROWS($C$2:$C54),$C$2:$C452,0)),\"\")","v":""},null,null,null,null,null,null,null,null,null,null,null,null,null,null,null,null,null,null,null,{"$f":"CONCATENATE(\"رشته: \",w!C54,\"-\",\" گرایش: \",w!D54,\" - \",w!B54,\" - دانشجویان \",w!K54,\" - \",w!E54)","v":"رشته: مديريت سازمان هاي دولتي ايران- گرایش: سياستگذاري دولتي(خط مشي گذاري عمومي) - دكتري تخصصي - دانشجویان ترم 02 - روزانه و پردیس"}]
[null,0,{"$f":"IF(B55=1,+COUNTIF($B$2:$B55,1),\"\")","v":""},{"$f":"IFERROR(INDEX($X$2:$X$400,MATCH(ROWS($C$2:$C55),$C$2:$C453,0)),\"\")","v":""},null,null,null,null,null,null,null,null,null,null,null,null,null,null,null,null,null,null,null,{"$f":"CONCATENATE(\"رشته: \",w!C55,\"-\",\" گرایش: \",w!D55,\" - \",w!B55,\" - دانشجویان \",w!K55,\" - \",w!E55)","v":"رشته: مديريت سازمان هاي دولتي ايران- گرایش: سياستگذاري دولتي(خط مشي گذاري عمومي) - دكتري تخصصي - دانشجویان ترم 02 - روزانه و پردیس"}]
[null,0,{"$f":"IF(B56=1,+COUNTIF($B$2:$B56,1),\"\")","v":""},{"$f":"IFERROR(INDEX($X$2:$X$400,MATCH(ROWS($C$2:$C56),$C$2:$C454,0)),\"\")","v":""},null,null,null,null,null,null,null,null,null,null,null,null,null,null,null,null,null,null,null,{"$f":"CONCATENATE(\"رشته: \",w!C56,\"-\",\" گرایش: \",w!D56,\" - \",w!B56,\" - دانشجویان \",w!K56,\" - \",w!E56)","v":"رشته: مديريت سازمان هاي دولتي ايران- گرایش: سياستگذاري دولتي(خط مشي گذاري عمومي) - دكتري تخصصي - دانشجویان ترم 02 - روزانه و پردیس"}]
[null,0,{"$f":"IF(B57=1,+COUNTIF($B$2:$B57,1),\"\")","v":""},{"$f":"IFERROR(INDEX($X$2:$X$400,MATCH(ROWS($C$2:$C57),$C$2:$C455,0)),\"\")","v":""},null,null,null,null,null,null,null,null,null,null,null,null,null,null,null,null,null,null,null,{"$f":"CONCATENATE(\"رشته: \",w!C57,\"-\",\" گرایش: \",w!D57,\" - \",w!B57,\" - دانشجویان \",w!K57,\" - \",w!E57)","v":"رشته: مديريت سازمان هاي دولتي ايران- گرایش: سياستگذاري دولتي(خط مشي گذاري عمومي) - دكتري تخصصي - دانشجویان ترم 02 - روزانه و پردیس"}]
[null,0,{"$f":"IF(B58=1,+COUNTIF($B$2:$B58,1),\"\")","v":""},{"$f":"IFERROR(INDEX($X$2:$X$400,MATCH(ROWS($C$2:$C58),$C$2:$C456,0)),\"\")","v":""},null,null,null,null,null,null,null,null,null,null,null,null,null,null,null,null,null,null,null,{"$f":"CONCATENATE(\"رشته: \",w!C58,\"-\",\" گرایش: \",w!D58,\" - \",w!B58,\" - دانشجویان \",w!K58,\" - \",w!E58)","v":"رشته: مديريت سازمان هاي دولتي ايران- گرایش: سياستگذاري دولتي(خط مشي گذاري عمومي) - دكتري تخصصي - دانشجویان ترم 02 - روزانه و پردیس"}]
[null,0,{"$f":"IF(B59=1,+COUNTIF($B$2:$B59,1),\"\")","v":""},{"$f":"IFERROR(INDEX($X$2:$X$400,MATCH(ROWS($C$2:$C59),$C$2:$C457,0)),\"\")","v":""},null,null,null,null,null,null,null,null,null,null,null,null,null,null,null,null,null,null,null,{"$f":"CONCATENATE(\"رشته: \",w!C59,\"-\",\" گرایش: \",w!D59,\" - \",w!B59,\" - دانشجویان \",w!K59,\" - \",w!E59)","v":"رشته: مديريت كسب و كار- گرایش: بازاريابي - استراتژي - كارشناسي ارشد - دانشجویان ترم 02 - پردیس"}]
[null,0,{"$f":"IF(B60=1,+COUNTIF($B$2:$B60,1),\"\")","v":""},{"$f":"IFERROR(INDEX($X$2:$X$400,MATCH(ROWS($C$2:$C60),$C$2:$C458,0)),\"\")","v":""},null,null,null,null,null,null,null,null,null,null,null,null,null,null,null,null,null,null,null,{"$f":"CONCATENATE(\"رشته: \",w!C60,\"-\",\" گرایش: \",w!D60,\" - \",w!B60,\" - دانشجویان \",w!K60,\" - \",w!E60)","v":"رشته: مديريت كسب و كار- گرایش: بازاريابي - استراتژي - كارشناسي ارشد - دانشجویان ترم 02 - روزانه"}]
[null,0,{"$f":"IF(B61=1,+COUNTIF($B$2:$B61,1),\"\")","v":""},{"$f":"IFERROR(INDEX($X$2:$X$400,MATCH(ROWS($C$2:$C61),$C$2:$C459,0)),\"\")","v":""},null,null,null,null,null,null,null,null,null,null,null,null,null,null,null,null,null,null,null,{"$f":"CONCATENATE(\"رشته: \",w!C61,\"-\",\" گرایش: \",w!D61,\" - \",w!B61,\" - دانشجویان \",w!K61,\" - \",w!E61)","v":"رشته: مديريت كسب و كار- گرایش: بازاريابي - استراتژي - كارشناسي ارشد - دانشجویان ترم 02 - پردیس"}]
[null,0,{"$f":"IF(B62=1,+COUNTIF($B$2:$B62,1),\"\")","v":""},{"$f":"IFERROR(INDEX($X$2:$X$400,MATCH(ROWS($C$2:$C62),$C$2:$C460,0)),\"\")","v":""},null,null,null,null,null,null,null,null,null,null,null,null,null,null,null,null,null,null,null,{"$f":"CONCATENATE(\"رشته: \",w!C62,\"-\",\" گرایش: \",w!D62,\" - \",w!B62,\" - دانشجویان \",w!K62,\" - \",w!E62)","v":"رشته: مديريت كسب و كار- گرایش: بازاريابي - استراتژي - كارشناسي ارشد - دانشجویان ترم 02 - روزانه"}]
[null,0,{"$f":"IF(B63=1,+COUNTIF($B$2:$B63,1),\"\")","v":""},{"$f":"IFERROR(INDEX($X$2:$X$400,MATCH(ROWS($C$2:$C63),$C$2:$C461,0)),\"\")","v":""},null,null,null,null,null,null,null,null,null,null,null,null,null,null,null,null,null,null,null,{"$f":"CONCATENATE(\"رشته: \",w!C63,\"-\",\" گرایش: \",w!D63,\" - \",w!B63,\" - دانشجویان \",w!K63,\" - \",w!E63)","v":"رشته: مديريت كسب و كار- گرایش: بازاريابي - استراتژي - كارشناسي ارشد - دانشجویان ترم 02 - پردیس"}]
[null,0,{"$f":"IF(B64=1,+COUNTIF($B$2:$B64,1),\"\")","v":""},{"$f":"IFERROR(INDEX($X$2:$X$400,MATCH(ROWS($C$2:$C64),$C$2:$C462,0)),\"\")","v":""},null,null,null,null,null,null,null,null,null,null,null,null,null,null,null,null,null,null,null,{"$f":"CONCATENATE(\"رشته: \",w!C64,\"-\",\" گرایش: \",w!D64,\" - \",w!B64,\" - دانشجویان \",w!K64,\" - \",w!E64)","v":"رشته: مديريت كسب و كار- گرایش: بازاريابي - استراتژي - كارشناسي ارشد - دانشجویان ترم 02 - روزانه"}]
[null,0,{"$f":"IF(B65=1,+COUNTIF($B$2:$B65,1),\"\")","v":""},{"$f":"IFERROR(INDEX($X$2:$X$400,MATCH(ROWS($C$2:$C65),$C$2:$C463,0)),\"\")","v":""},null,null,null,null,null,null,null,null,null,null,null,null,null,null,null,null,null,null,null,{"$f":"CONCATENATE(\"رشته: \",w!C66,\"-\",\" گرایش: \",w!D66,\" - \",w!B66,\" - دانشجویان \",w!K66,\" - \",w!E66)","v":"رشته: مديريت كسب و كار- گرایش: بازاريابي - استراتژي - كارشناسي ارشد - دانشجویان ترم 02 - پردیس"}]
[null,0,{"$f":"IF(B66=1,+COUNTIF($B$2:$B66,1),\"\")","v":""},{"$f":"IFERROR(INDEX($X$2:$X$400,MATCH(ROWS($C$2:$C66),$C$2:$C464,0)),\"\")","v":""},null,null,null,null,null,null,null,null,null,null,null,null,null,null,null,null,null,null,null,{"$f":"CONCATENATE(\"رشته: \",w!C67,\"-\",\" گرایش: \",w!D67,\" - \",w!B67,\" - دانشجویان \",w!K67,\" - \",w!E67)","v":"رشته: مديريت كسب و كار- گرایش: بازاريابي - استراتژي - كارشناسي ارشد - دانشجویان ترم 02 - روزانه"}]
[null,{"$f":"--ISNUMBER(SEARCH($E$1,X:X))","v":0},{"$f":"IF(B67=1,+COUNTIF($B$2:$B67,1),\"\")","v":""},{"$f":"IFERROR(INDEX($X$2:$X$400,MATCH(ROWS($C$2:$C67),$C$2:$C465,0)),\"\")","v":""},null,null,null,null,null,null,null,null,null,null,null,null,null,null,null,null,null,null,null,{"$f":"CONCATENATE(\"رشته: \",w!C68,\"-\",\" گرایش: \",w!D68,\" - \",w!B68,\" - دانشجویان \",w!K68,\" - \",w!E68)","v":"رشته: مديريت كسب و كار- گرایش: بازاريابي - كارشناسي ارشد - دانشجویان ترم 04 - روزانه"}]
[null,0,{"$f":"IF(B68=1,+COUNTIF($B$2:$B68,1),\"\")","v":""},{"$f":"IFERROR(INDEX($X$2:$X$400,MATCH(ROWS($C$2:$C68),$C$2:$C466,0)),\"\")","v":""},null,null,null,null,null,null,null,null,null,null,null,null,null,null,null,null,null,null,null,{"$f":"CONCATENATE(\"رشته: \",w!C69,\"-\",\" گرایش: \",w!D69,\" - \",w!B69,\" - دانشجویان \",w!K69,\" - \",w!E69)","v":"رشته: مديريت كسب و كار- گرایش: بازاريابي - كارشناسي ارشد - دانشجویان ترم 04 - روزانه"}]
[null,0,{"$f":"IF(B69=1,+COUNTIF($B$2:$B69,1),\"\")","v":""},{"$f":"IFERROR(INDEX($X$2:$X$400,MATCH(ROWS($C$2:$C69),$C$2:$C467,0)),\"\")","v":""},null,null,null,null,null,null,null,null,null,null,null,null,null,null,null,null,null,null,null,{"$f":"CONCATENATE(\"رشته: \",w!C70,\"-\",\" گرایش: \",w!D70,\" - \",w!B70,\" - دانشجویان \",w!K70,\" - \",w!E70)","v":"رشته: مديريت كسب و كار- گرایش: بازاريابي - كارشناسي ارشد - دانشجویان ترم 04 - پردیس"}]
[null,0,{"$f":"IF(B70=1,+COUNTIF($B$2:$B70,1),\"\")","v":""},{"$f":"IFERROR(INDEX($X$2:$X$400,MATCH(ROWS($C$2:$C70),$C$2:$C468,0)),\"\")","v":""},null,null,null,null,null,null,null,null,null,null,null,null,null,null,null,null,null,null,null,{"$f":"CONCATENATE(\"رشته: \",w!C71,\"-\",\" گرایش: \",w!D71,\" - \",w!B71,\" - دانشجویان \",w!K71,\" - \",w!E71)","v":"رشته: مديريت كسب و كار- گرایش: بازاريابي - كارشناسي ارشد - دانشجویان ترم 04 - روزانه"}]
[null,0,{"$f":"IF(B71=1,+COUNTIF($B$2:$B71,1),\"\")","v":""},{"$f":"IFERROR(INDEX($X$2:$X$400,MATCH(ROWS($C$2:$C71),$C$2:$C469,0)),\"\")","v":""},null,null,null,null,null,null,null,null,null,null,null,null,null,null,null,null,null,null,null,{"$f":"CONCATENATE(\"رشته: \",w!C72,\"-\",\" گرایش: \",w!D72,\" - \",w!B72,\" - دانشجویان \",w!K72,\" - \",w!E72)","v":"رشته: مديريت كسب و كار- گرایش: بازاريابي - استراتژي - كارشناسي ارشد - دانشجویان ترم 04 - پردیس"}]
[null,0,{"$f":"IF(B72=1,+COUNTIF($B$2:$B72,1),\"\")","v":""},{"$f":"IFERROR(INDEX($X$2:$X$400,MATCH(ROWS($C$2:$C72),$C$2:$C470,0)),\"\")","v":""},null,null,null,null,null,null,null,null,null,null,null,null,null,null,null,null,null,null,null,{"$f":"CONCATENATE(\"رشته: \",w!C73,\"-\",\" گرایش: \",w!D73,\" - \",w!B73,\" - دانشجویان \",w!K73,\" - \",w!E73)","v":"رشته: مديريت كسب و كار- گرایش: بازاريابي - استراتژي - كارشناسي ارشد - دانشجویان ترم 04 - روزانه"}]
[null,0,{"$f":"IF(B73=1,+COUNTIF($B$2:$B73,1),\"\")","v":""},{"$f":"IFERROR(INDEX($X$2:$X$400,MATCH(ROWS($C$2:$C73),$C$2:$C471,0)),\"\")","v":""},null,null,null,null,null,null,null,null,null,null,null,null,null,null,null,null,null,null,null,{"$f":"CONCATENATE(\"رشته: \",w!C74,\"-\",\" گرایش: \",w!D74,\" - \",w!B74,\" - دانشجویان \",w!K74,\" - \",w!E74)","v":"رشته: مديريت كسب و كار- گرایش: استراتژي - كارشناسي ارشد - دانشجویان ترم 04 - پردیس"}]
[null,1,{"$f":"IF(B74=1,+COUNTIF($B$2:$B74,1),\"\")","v":1},{"$f":"IFERROR(INDEX($X$2:$X$400,MATCH(ROWS($C$2:$C74),$C$2:$C472,0)),\"\")","v":""},null,null,null,null,null,null,null,null,null,null,null,null,null,null,null,null,null,null,null,{"$f":"CONCATENATE(\"رشته: \",w!C75,\"-\",\" گرایش: \",w!D75,\" - \",w!B75,\" - دانشجویان \",w!K75,\" - \",w!E75)","v":"رشته: مديريت كسب و كار- گرایش: استراتژي - كارشناسي ارشد - دانشجویان ترم 04 - روزانه"}]
[null,0,{"$f":"IF(B75=1,+COUNTIF($B$2:$B75,1),\"\")","v":""},{"$f":"IFERROR(INDEX($X$2:$X$400,MATCH(ROWS($C$2:$C75),$C$2:$C473,0)),\"\")","v":""},null,null,null,null,null,null,null,null,null,null,null,null,null,null,null,null,null,null,null,{"$f":"CONCATENATE(\"رشته: \",w!C76,\"-\",\" گرایش: \",w!D76,\" - \",w!B76,\" - دانشجویان \",w!K76,\" - \",w!E76)","v":"رشته: مديريت كسب و كار- گرایش: استراتژي - كارشناسي ارشد - دانشجویان ترم 04 - پردیس"}]
[null,1,{"$f":"IF(B76=1,+COUNTIF($B$2:$B76,1),\"\")","v":2},{"$f":"IFERROR(INDEX($X$2:$X$400,MATCH(ROWS($C$2:$C76),$C$2:$C474,0)),\"\")","v":""},null,null,null,null,null,null,null,null,null,null,null,null,null,null,null,null,null,null,null,{"$f":"CONCATENATE(\"رشته: \",w!C77,\"-\",\" گرایش: \",w!D77,\" - \",w!B77,\" - دانشجویان \",w!K77,\" - \",w!E77)","v":"رشته: مديريت كسب و كار- گرایش: استراتژي - كارشناسي ارشد - دانشجویان ترم 04 - روزانه"}]
[null,0,{"$f":"IF(B77=1,+COUNTIF($B$2:$B77,1),\"\")","v":""},{"$f":"IFERROR(INDEX($X$2:$X$400,MATCH(ROWS($C$2:$C77),$C$2:$C475,0)),\"\")","v":""},null,null,null,null,null,null,null,null,null,null,null,null,null,null,null,null,null,null,null,{"$f":"CONCATENATE(\"رشته: \",w!C78,\"-\",\" گرایش: \",w!D78,\" - \",w!B78,\" - دانشجویان \",w!K78,\" - \",w!E78)","v":"رشته: مديريت كسب و كار- گرایش: استراتژي - كارشناسي ارشد - دانشجویان ترم 04 - پردیس"}]
[null,1,{"$f":"IF(B78=1,+COUNTIF($B$2:$B78,1),\"\")","v":3},{"$f":"IFERROR(INDEX($X$2:$X$400,MATCH(ROWS($C$2:$C78),$C$2:$C476,0)),\"\")","v":""},null,null,null,null,null,null,null,null,null,null,null,null,null,null,null,null,null,null,null,{"$f":"CONCATENATE(\"رشته: \",w!C79,\"-\",\" گرایش: \",w!D79,\" - \",w!B79,\" - دانشجویان \",w!K79,\" - \",w!E79)","v":"رشته: مديريت كسب و كار- گرایش: استراتژي - كارشناسي ارشد - دانشجویان ترم 04 - روزانه"}]
[null,0,{"$f":"IF(B79=1,+COUNTIF($B$2:$B79,1),\"\")","v":""},{"$f":"IFERROR(INDEX($X$2:$X$400,MATCH(ROWS($C$2:$C79),$C$2:$C477,0)),\"\")","v":""},null,null,null,null,null,null,null,null,null,null,null,null,null,null,null,null,null,null,null,{"$f":"CONCATENATE(\"رشته: \",w!C80,\"-\",\" گرایش: \",w!D80,\" - \",w!B80,\" - دانشجویان \",w!K80,\" - \",w!E80)","v":"رشته: مديريت كسب و كار- گرایش: بازاريابي - استراتژي - كارشناسي ارشد - دانشجویان ترم 04 و بیشتر - پردیس"}]
[null,0,{"$f":"IF(B80=1,+COUNTIF($B$2:$B80,1),\"\")","v":""},{"$f":"IFERROR(INDEX($X$2:$X$400,MATCH(ROWS($C$2:$C80),$C$2:$C478,0)),\"\")","v":""},null,null,null,null,null,null,null,null,null,null,null,null,null,null,null,null,null,null,null,{"$f":"CONCATENATE(\"رشته: \",w!C81,\"-\",\" گرایش: \",w!D81,\" - \",w!B81,\" - دانشجویان \",w!K81,\" - \",w!E81)","v":"رشته: مديريت كسب و كار- گرایش: بازاريابي - استراتژي - كارشناسي ارشد - دانشجویان ترم 04 و بیشتر - روزانه"}]
[null,0,{"$f":"IF(B81=1,+COUNTIF($B$2:$B81,1),\"\")","v":""},{"$f":"IFERROR(INDEX($X$2:$X$400,MATCH(ROWS($C$2:$C81),$C$2:$C479,0)),\"\")","v":""},null,null,null,null,null,null,null,null,null,null,null,null,null,null,null,null,null,null,null,{"$f":"CONCATENATE(\"رشته: \",w!#REF!,\"-\",\" گرایش: \",w!#REF!,\" - \",w!#REF!,\" - دانشجویان \",w!#REF!,\" - \",w!#REF!)","v":{"$error":"#REF!"}}]
[null,0,{"$f":"IF(B82=1,+COUNTIF($B$2:$B82,1),\"\")","v":""},{"$f":"IFERROR(INDEX($X$2:$X$400,MATCH(ROWS($C$2:$C82),$C$2:$C480,0)),\"\")","v":""},null,null,null,null,null,null,null,null,null,null,null,null,null,null,null,null,null,null,null,{"$f":"CONCATENATE(\"رشته: \",w!#REF!,\"-\",\" گرایش: \",w!#REF!,\" - \",w!#REF!,\" - دانشجویان \",w!#REF!,\" - \",w!#REF!)","v":{"$error":"#REF!"}}]
[null,0,{"$f":"IF(B83=1,+COUNTIF($B$2:$B83,1),\"\")","v":""},{"$f":"IFERROR(INDEX($X$2:$X$400,MATCH(ROWS($C$2:$C83),$C$2:$C481,0)),\"\")","v":""}]

{"sheet":"ww","index":3,"n_rows":285,"n_cols":9,"rows_kept":285,"cut":false,"hidden":false,"merged":[]}
["رشته: علوم اقتصادی- گرایش: برنامه ريزي سيستمهاي اقتصادي - كارشناسي ارشد - دانشجویان ترم 02 - روزانه"]
[null,null,null,null,"مشخصات ارائه",null,null,"زمان امتحان"]
["نام درس"," واحد","استاد","روز","ساعت","کلاس","تاریخ","ساعت","توضیحات"]
["اقتصاد سنجي ( جبرانی )","3","شوال پور","شنبه\nسه شنبه","13-15\n10-12","207\n208","99/03/25","8",0]
["اقتصاد كلان",4,"رفیعی","شنبه\nسه شنبه","10-12\n15-17","207\n208","99/03/27","8",0]
["تحلیل تصمیم گیری",3,"کرمانی","شنبه\nسه شنبه","15-17\n13-15","207\n208","99/03/31","8",0]
["سيستمهاي ديناميكي1",3,"پارسانژاد","شنبه\nسه شنبه","8-10\n8-10","207\n207","99/04/04","8",0]
["","","","","","","","",""]
["","","","","","","","",""]
["","","","","","","","",""]
[]
["رشته: علوم اقتصادی- گرایش: برنامه ريزي سيستمهاي اقتصادي - كارشناسي ارشد - دانشجویان ترم 04 و بیشتر - روزانه"]
[null,null,null,null,"مشخصات ارائه",null,null,"زمان امتحان"]
["نام درس"," واحد","استاد","روز","ساعت","کلاس","تاریخ","ساعت","توضیحات"]
["پایان نامه",6,0,"\n","\n",0,0,0,0]
["","","","","","","","",""]
["","","","","","","","",""]
["","","","","","","","",""]
["","","","","","","","",""]
["","","","","","","","",""]
["","","","","","","","",""]
[]
["رشته: علوم اقتصادی- گرایش: توسعه اقتصادي و برنامه ريزي - كارشناسي ارشد - دانشجویان ترم 02 - روزانه"]
[null,null,null,null,"مشخصات ارائه",null,null,"زمان امتحان"]
["نام درس"," واحد","استاد","روز","ساعت","کلاس","تاریخ","ساعت","توضیحات"]
["اقتصاد خرد",4,"رفیعی","شنبه\nدوشنبه","8-10\n8-10","208\n208","99/03/27","8",0]
["سیاستگذاری در بخش صنعت","3","محمدپور عمران","شنبه\nدوشنبه","13-15\n13-15","208\n208","99/03/31","8",0]
["اقتصاد كلان",4,"ابوالحسنی","شنبه\nدوشنبه","15-17\n15-17","208\n208","99/04/04","8",0]
["","","","","","","","",""]
["","","","","","","","",""]
["","","","","","","","",""]
["","","","","","","","",""]
[]
["رشته: علوم اقتصادی- گرایش: توسعه اقتصادي و برنامه ريزي - كارشناسي ارشد - دانشجویان ترم 04 و بیشتر - روزانه"]
[null,null,null,null,"مشخصات ارائه",null,null,"زمان امتحان"]
["نام درس"," واحد","استاد","روز","ساعت","کلاس","تاریخ","ساعت","توضیحات"]
["پایان نامه",6,0,"\n","\n",0,0,0,0]
["","","","","","","","",""]
["","","","","","","","",""]
["","","","","","","","",""]
["","","","","","","","",""]
["","","","","","","","",""]
["","","","","","","","",""]
[]
["رشته: مهندسي صنايع- گرایش: سيستمهاي كلان - كارشناسي ارشد - دانشجویان ترم 02 - روزانه"]
[null,null,null,null,"مشخصات ارائه",null,null,"زمان امتحان"]
["نام درس"," واحد","استاد","روز","ساعت","کلاس","تاریخ","ساعت","توضیحات"]
["اقتصاد كلان پيشرفته",3,"میرزامحمدی","یکشنبه\nسه شنبه","8-10\n8-10","207\n208","99/04/02","8",0]
["داده كاوي: مدلها، الگوريتمها و كاربردها",3,"رسولی","یکشنبه\nسه شنبه","10-12\n10-12","207\n207","99/03/26","8",0]
["مدلسازي پوياييهاي سيستم",3,"پارسانژاد","یکشنبه\nسه شنبه","13-15\n13-15","207\n207","99/04/04","8",0]
["مفاهیم و مدلهای تحلیل شبکه های اجتماعی","3","کرمانی","یکشنبه\nسه شنبه","15-17\n15-17","207\n207","99/03/31","10",0]
["","","","","","","","",""]
["","","","","","","","",""]
["","","","","","","","",""]
[]
["رشته: مهندسي صنايع- گرایش: سيستمهاي كلان - كارشناسي ارشد - دانشجویان ترم 04 و بیشتر - روزانه"]
[null,null,null,null,"مشخصات ارائه",null,null,"زمان امتحان"]
["نام درس"," واحد","استاد","روز","ساعت","کلاس","تاریخ","ساعت","توضیحات"]
["پایان نامه",3,0,"\n","\n",0,0,0,0]
["","","","","","","","",""]
["","","","","","","","",""]
["","","","","","","","",""]
["","","","","","","","",""]
["","","","","","","","",""]
["","","","","","","","",""]
[]
["رشته: سياست گذاري علم و فناوري- گرایش: - - دكتري تخصصي - دانشجویان ترم 02 - روزانه و پردیس"]
[null,null,null,null,"مشخصات ارائه",null,null,"زمان امتحان"]
["نام درس"," واحد","استاد","روز","ساعت","کلاس","تاریخ","ساعت","توضیحات"]
["انتقال علم و فناوري",2,"منطقی","چهارشنبه\n","10-12\n",207,"99/03/25",8,0]
["علم ، فناوري و جامعه",2,"رفیعی","چهارشنبه\n","8-10\n",207,"99/03/27","8",0]
["مدلهاي سياستگذاري علم و فناوري",2,"سیف الدین","چهارشنبه\n","15-17\n",207,"99/04/01",14,0]
["مديريت دانش و فناوري اطلاعات",2,"ذاکری","شنبه\n","13-15\n",209,"99/04/03",8,0]
["ارزیابی سرمایه گذاری و مدیریت ریسک فناوری",2,"شوال پور","چهارشنبه\n","13-15\n",207,"99/03/31","8",0]
["مطالاعات گروهی",0,"رفیعی","شنبه\n","15-17\n","آزمایشگاه فناوری های نرم","ندارد","ندارد",0]
["","","","","","","","",""]
[]
["رشته: كارآفريني- گرایش: كسب و كار جديد - كارشناسي ارشد - دانشجویان ترم 02 - روزانه"]
[null,null,null,null,"مشخصات ارائه",null,null,"زمان امتحان"]
["نام درس"," واحد","استاد","روز","ساعت","کلاس","تاریخ","ساعت","توضیحات"]
["الگوهاي تصميم گيري كارآفرينان",2,"پارسانژاد","چهارشنبه\n","10-12\n",208,"99/03/26","10",0]
["بازاريابي خدمات",2,"حمیدی زاده","یکشنبه\n","13-15\n",208,"99/04/02","10",0]
["تشخيص فرصت هاي كارآفريني",2,"صالحی","یکشنبه\n","8-10\n",208,"99/03/27","8",0]
["تئوريهاي مديريت پيشرفته",2,"عبدالحمید","یکشنبه\n","10-12\n",208,"99/04/05","14",0]
["كارآفريني در بستر فناوري اطلاعات",2,"خانی زاد","چهارشنبه\n","8-10\n",208,"99/04/01","14",0]
["مديريت زنجيره تامين",2,"تیموری","یکشنبه\n","15-17\n",208,"99/04/03","14",0]
["","","","","","","","",""]
[]
["رشته: كارآفريني- گرایش: كسب و كار جديد - كارشناسي ارشد - دانشجویان ترم 04 - روزانه"]
[null,null,null,null,"مشخصات ارائه",null,null,"زمان امتحان"]
["نام درس"," واحد","استاد","روز","ساعت","کلاس","تاریخ","ساعت","توضیحات"]
["مباحث منتخب",2,"پارسانژاد","سه شنبه\n","10-12\n",213,"99/04/04","8",0]
["","","","","","","","",""]
["","","","","","","","",""]
["","","","","","","","",""]
["","","","","","","","",""]
["","","","","","","","",""]
["","","","","","","","",""]
[]
["رشته: كارآفريني- گرایش: كسب و كار جديد - كارشناسي ارشد - دانشجویان ترم 04 و بیشتر - روزانه"]
[null,null,null,null,"مشخصات ارائه",null,null,"زمان امتحان"]
["نام درس"," واحد","استاد","روز","ساعت","کلاس","تاریخ","ساعت","توضیحات"]
["پایان نامه",4,0,"\n","\n",0,0,0,0]
["","","","","","","","",""]
["","","","","","","","",""]
["","","","","","","","",""]
["","","","","","","","",""]
["","","","","","","","",""]
["","","","","","","","",""]
[]
["رشته: مديريت فناوري اطلاعات- گرایش: كسب و كار الكترونيك - كارشناسي ارشد - دانشجویان ترم 02 - پردیس"]
[null,null,null,null,"مشخصات ارائه",null,null,"زمان امتحان"]
["نام درس"," واحد","استاد","روز","ساعت","کلاس","تاریخ","ساعت","توضیحات"]
["سيستمهاي يكپارچه كسب و كار الكترونيك",2,"وحیدی","پنج شنبه\n","8-10\n",207,"99/04/02",14,0]
["مباني تئوري و فلسفي سيستمهاي اطلاعاتي",2,"رفیعی آتانی","چهارشنبه\n","13-15\n",208,"99/04/04","8",0]
["مدلهاي كسب و كار الكترونيك",2,"صالحی","چهارشنبه\n","10-12\n",209,"99/03/31",14,0]
["مديريت استراتژيك سيستمهاي اطلاعاتي",2,"ذاکری","چهارشنبه\n","15-17\n",209,"99/03/27",14,0]
["مديريت امنيت فناوري اطلاعات",2,"خانی زاد","پنج شنبه\n","10-12\n",207,"99/03/24",10,0]
["","","","","","","","",""]
["","","","","","","","",""]
[]
["رشته: مديريت فناوري اطلاعات- گرایش: كسب و كار الكترونيك - كارشناسي ارشد - دانشجویان ترم 02 - روزانه"]
[null,null,null,null,"مشخصات ارائه",null,null,"زمان امتحان"]
["نام درس"," واحد","استاد","روز","ساعت","کلاس","تاریخ","ساعت","توضیحات"]
["سيستمهاي يكپارچه كسب و كار الكترونيك",2,"وحیدی","چهارشنبه\n","15-17\n",208,"99/04/02",14,0]
["مباني تئوري و فلسفي سيستمهاي اطلاعاتي",2,"رفیعی آتانی","دوشنبه\n","10-12\n",207,"99/04/04","8",0]
["مدلهاي كسب و كار الكترونيك",2,"صالحی","دوشنبه\n","8-10\n",207,"99/03/31","8",0]
["مديريت استراتژيك سيستمهاي اطلاعاتي",2,"ذاکری","چهارشنبه\n","8-10\n",209,"99/03/27",14,0]
["مديريت امنيت فناوري اطلاعات",2,"خانی زاد","دوشنبه\n","15-17\n",207,"99/03/24",10,0]
["","","","","","","","",""]
["","","","","","","","",""]
[]
["رشته: مديريت فناوري اطلاعات- گرایش: كسب و كار الكترونيك - كارشناسي ارشد - دانشجویان ترم 04 و بیشتر - پردیس"]
[null,null,null,null,"مشخصات ارائه",null,null,"زمان امتحان"]
["نام درس"," واحد","استاد","روز","ساعت","کلاس","تاریخ","ساعت","توضیحات"]
["پایان نامه",4,0,"\n","\n",0,0,0,0]
["","","","","","","","",""]
["","","","","","","","",""]
["","","","","","","","",""]
["","","","","","","","",""]
["","","","","","","","",""]
["","","","","","","","",""]
[]
["رشته: مديريت فناوري اطلاعات- گرایش: كسب و كار الكترونيك - كارشناسي ارشد - دانشجویان ترم 04 و بیشتر - روزانه"]
[null,null,null,null,"مشخصات ارائه",null,null,"زمان امتحان"]
["نام درس"," واحد","استاد","روز","ساعت","کلاس","تاریخ","ساعت","توضیحات"]
["پایان نامه",4,0,"\n","\n",0,0,0,0]
["","","","","","","","",""]
["","","","","","","","",""]
["","","","","","","","",""]
["","","","","","","","",""]
["","","","","","","","",""]
["","","","","","","","",""]
[]
["رشته: مديريت تكنولوژي- گرایش: نوآوري تكنولوژي - سياست هاي تحقيق و توسعه - كارشناسي ارشد - دانشجویان ترم 02 - روزانه"]
[null,null,null,null,"مشخصات ارائه",null,null,"زمان امتحان"]
["نام درس"," واحد","استاد","روز","ساعت","کلاس","تاریخ","ساعت","توضیحات"]
["ارزيابي تكنولوژي",2,"شوال پور","شنبه\n","15-17\n",210,"99/03/25",14,0]
["پروژه ترم",2,"عبدالحمید","شنبه\n","13-15\n",210,"99/03/29","8",0]
["پيش بيني تكنولوژي",2,"شفیعا","شنبه\n","10-12\n",208,"99/04/03","10",0]
["نظام ملی نوآوری","2","صالحی","چهارشنبه\n","8-10\n",210,"99/03/27","8",0]
["مديريت رفتار سازماني پيشرفته",2,"بنیادی","چهارشنبه\n","10-12\n",210,"99/04/05",10,0]
["","","","","","","","",""]
["","","","","","","","",""]
[]
["رشته: مديريت تكنولوژي- گرایش: نوآوري تكنولوژي - سياست هاي تحقيق و توسعه - كارشناسي ارشد - دانشجویان ترم 04 و بیشتر - روزانه"]
[null,null,null,null,"مشخصات ارائه",null,null,"زمان امتحان"]
["نام درس"," واحد","استاد","روز","ساعت","کلاس","تاریخ","ساعت","توضیحات"]
["پايان نامه",0,0,"\n","\n",0,0,0,0]
["","","","","","","","",""]
["","","","","","","","",""]
["","","","","","","","",""]
["","","","","","","","",""]
["","","","","","","","",""]
["","","","","","","","",""]
[]
["رشته: مديريت تكنولوژي- گرایش: مديريت نوآوري - دكتري تخصصي - دانشجویان ترم 02 - روزانه و پردیس"]
[null,null,null,null,"مشخصات ارائه",null,null,"زمان امتحان"]
["نام درس"," واحد","استاد","روز","ساعت","کلاس","تاریخ","ساعت","توضیحات"]
["توانايي هاي نوآوري",3,"منطقی","چهارشنبه\n","8-10\n",213,"99/03/25",8,0]
["فرايند نوآوري و تجربه كشورهاي پيشرفته",3,"بنیادی","چهارشنبه\n","13-15\n",209,"99/04/04","8",0]
["مباني استراتژيهاي توسعه تكنولوژي",2,"شوال پور","شنبه\n","8-10\n",209,"99/03/27","8",0]
["مباني نظريه هاي اقتصاددانان كلاسيك و نئوكلاسيك و نظريه پردازان جديد در زمينه توسعه تكنولوژي و سير تح",2,"میرزامحمدی","چهارشنبه\n","10-12\n",213,"99/04/02","8",0]
["مطالاعات گروهی",0,"رفیعی","شنبه\n","15-17\n","آزمایشگاه فناوری های نرم","ندارد","ندارد",0]
["","","","","","","","",""]
["","","","","","","","",""]
[]
["رشته: مديريت سازمان هاي دولتي ايران- گرایش: سياستگذاري دولتي(خط مشي گذاري عمومي) - دكتري تخصصي - دانشجویان ترم 02 - روزانه و پردیس"]
[null,null,null,null,"مشخصات ارائه",null,null,"زمان امتحان"]
["نام درس"," واحد","استاد","روز","ساعت","کلاس","تاریخ","ساعت","توضیحات"]
["اجرا و ارزيابي خط مشي هاي عمومي در ايران",2,"عبدالحمید","دوشنبه\n","8-10\n",209,"99/04/05","14",0]
["مبانی پژوهشی قرآن و مفاهیم مدیریتی در قرآن (تفسیر)",2,"معینی","شنبه\n","10-12\n",209,"99/03/27","8",0]
["مبانی فلسفی اداره امور عمومی از دیدگاه اسلام",2,"رفیعی","شنبه\n","13-15\n",213,"99/03/25","8",0]
["حقوق اداری و سازمان نظام ج ا ا",0,"موسی زاده","شنبه\n","8-10\n",210,"99/04/02","8",0]
["نظريه هاي خط مشي گذاري عمومي با رويكرد تطبيقي (اسلام و معاصر)",2,"علی احمدی","دوشنبه\n","10-12\n",208,"99/03/31",8,0]
["مطالاعات گروهی",0,"رفیعی","\n","\n",0,"ندارد","ندارد",0]
["","","","","","","","",""]
[]
["رشته: مديريت كسب و كار- گرایش: بازاريابي - استراتژي - كارشناسي ارشد - دانشجویان ترم 02 - پردیس"]
[null,null,null,null,"مشخصات ارائه",null,null,"زمان امتحان"]
["نام درس"," واحد","استاد","روز","ساعت","کلاس","تاریخ","ساعت","توضیحات"]
["اخلاق و احكام كسب و كار",3,"عبدالحمید","چهارشنبه\n","13-16\n",213,"99/03/27","8",0]
["اصول اقتصاد",3,"میرزامحمدی","چهارشنبه\n","16-19\n",210,"99/04/01","10",0]
["تصميم گيري براي مديران",3,"سبحانی فرد","چهارشنبه\n","10-13\n",0,"99/03/31","8",0]
["مديريت رفتار سازماني",2,"بنیادی","چهارشنبه\n","7-10\n",209,"99/04/05",10,0]
["","","","","","","","",""]
["","","","","","","","",""]
["","","","","","","","",""]
[]
["رشته: مديريت كسب و كار- گرایش: بازاريابي - استراتژي - كارشناسي ارشد - دانشجویان ترم 02 - روزانه"]
[null,null,null,null,"مشخصات ارائه",null,null,"زمان امتحان"]
["نام درس"," واحد","استاد","روز","ساعت","کلاس","تاریخ","ساعت","توضیحات"]
["اخلاق و احكام كسب و كار",3,"معینی","یکشنبه\nسه شنبه","15-17\n13-15","209\n209","99/03/27","8",0]
["اصول اقتصاد",3,"حکیمی پور","یکشنبه\nسه شنبه","10-12\n10-12","209\n209","99/03/24","8",0]
["تصميم گيري براي مديران",3,"سبحانی فرد","یکشنبه\nسه شنبه","13-15\n15-17","209\n209","99/03/31","8",0]
["مديريت رفتار سازماني",2,"بنیادی","یکشنبه\nسه شنبه","8-10\n8-10","209\n209","99/04/05",10,0]
["","","","","","","","",""]
["","","","","","","","",""]
["","","","","","","","",""]
[]
["رشته: مديريت كسب و كار- گرایش: بازاريابي - كارشناسي ارشد - دانشجویان ترم 04 - روزانه"]
[null,null,null,null,"مشخصات ارائه",null,null,"زمان امتحان"]
["نام درس"," واحد","استاد","روز","ساعت","کلاس","تاریخ","ساعت","توضیحات"]
["رفتار مصرف کننده","3","سبحانی فرد","یکشنبه\nسه شنبه","15-17\n13-15","210\n210","99/03/24",14,0]
["تحقیقات بازاریابی","3","حمیدی زاده","یکشنبه\n","10-13\n",210,"99/03/29",14,0]
["مديريت مالي","3","بیات","یکشنبه\n","7-10\n",213,"99/04/02","8",0]
["","","","","","","","",""]
["","","","","","","","",""]
["","","","","","","","",""]
["","","","","","","","",""]
[]
["رشته: مديريت كسب و كار- گرایش: بازاريابي - كارشناسي ارشد - دانشجویان ترم 04 - پردیس"]
[null,null,null,null,"مشخصات ارائه",null,null,"زمان امتحان"]
["نام درس"," واحد","استاد","روز","ساعت","کلاس","تاریخ","ساعت","توضیحات"]
["مديريت عملیات",3,"محمدی","پنج شنبه\n","14-17\n",207,"99/04/02","8",0]
["","","","","","","","",""]
["","","","","","","","",""]
["","","","","","","","",""]
["","","","","","","","",""]
["","","","","","","","",""]
["","","","","","","","",""]
[]
["رشته: مديريت كسب و كار- گرایش: بازاريابي - استراتژي - كارشناسي ارشد - دانشجویان ترم 04 - پردیس"]
[null,null,null,null,"مشخصات ارائه",null,null,"زمان امتحان"]
["نام درس"," واحد","استاد","روز","ساعت","کلاس","تاریخ","ساعت","توضیحات"]
["مدیریت استراتژیک پیشرفته","3","حمیدی زاده","پنج شنبه\n","7-10\n",208,"99/04/04","8",0]
["","","","","","","","",""]
["","","","","","","","",""]
["","","","","","","","",""]
["","","","","","","","",""]
["","","","","","","","",""]
["","","","","","","","",""]
[]
["رشته: مديريت كسب و كار- گرایش: بازاريابي - استراتژي - كارشناسي ارشد - دانشجویان ترم 04 - روزانه"]
[null,null,null,null,"مشخصات ارائه",null,null,"زمان امتحان"]
["نام درس"," واحد","استاد","روز","ساعت","کلاس","تاریخ","ساعت","توضیحات"]
["پیاده سازی استراتژی","3","نورعلیزاده","یکشنبه\nسه شنبه","15-17\n15-17","213\n213","99/03/29",10,0]
["","","","","","","","",""]
["","","","","","","","",""]
["","","","","","","","",""]
["","","","","","","","",""]
["","","","","","","","",""]
["","","","","","","","",""]
[]
["رشته: مديريت كسب و كار- گرایش: استراتژي - كارشناسي ارشد - دانشجویان ترم 04 - پردیس"]
[null,null,null,null,"مشخصات ارائه",null,null,"زمان امتحان"]
["نام درس"," واحد","استاد","روز","ساعت","کلاس","تاریخ","ساعت","توضیحات"]
["مدیریت اتحادهای اسراتژیک","3","علی احمدی","چهارشنبه\n","15-18\n",213,"99/03/24",10,0]
["مدیریت استراتژیک فناوری","3","ذاکری","چهارشنبه\n","10-13\n",0,"99/03/26",10,0]
["پایان نامه",6,0,"\n","\n",0,0,0,0]
["","","","","","","","",""]
["","","","","","","","",""]
["","","","","","","","",""]
["","","","","","","","",""]
[]
["رشته: مديريت كسب و كار- گرایش: استراتژي - كارشناسي ارشد - دانشجویان ترم 04 - روزانه"]
[null,null,null,null,"مشخصات ارائه",null,null,"زمان امتحان"]
["نام درس"," واحد","استاد","روز","ساعت","کلاس","تاریخ","ساعت","توضیحات"]
["مباحث منتخب","3","رضایی","سه شنبه\n","7-10\n",210,"99/03/31","8",0]
["مدیریت استراتژیک فناوری","3","ذاکری","یکشنبه\nسه شنبه","10-12\n10-12","213\n210","99/03/26",10,0]
["پایان نامه",6,0,"\n","\n",0,0,0,0]
["","","","","","","","",""]
["","","","","","","","",""]
["","","","","","","","",""]
["","","","","","","","",""]

{"sheet":"Sheet2","index":4,"n_rows":161,"n_cols":13,"rows_kept":161,"cut":false,"hidden":false,"merged":[]}
[null,null,"رشته","گرایش","دوره","درس","استاد","روز",null,"ساعت",null,"کلاس"]
[{"$f":"CONCATENATE(H2,\" - \",J2,\" - \",L2)","v":"شنبه - 13-15 - 207"},{"$f":"CONCATENATE(F2,CHAR(10),E2,\" - \",G2)","v":"اقتصاد سنجي ( جبرانی )\nروزانه - شوال پور"},{"$f":"w!C2","v":"علوم اقتصادی"},{"$f":"w!D2","v":"برنامه ريزي سيستمهاي اقتصادي"},{"$f":"w!E2","v":"روزانه"},{"$f":"w!F2","v":"اقتصاد سنجي ( جبرانی )"},{"$f":"w!I2","v":"شوال پور"},{"$f":"w!AB2","v":"شنبه"},{"$f":"w!AC2","v":"سه شنبه"},{"$f":"w!AE2","v":"13-15"},{"$f":"w!AF2","v":"10-12"},{"$f":"w!AH2","v":207},{"$f":"w!AI2","v":"208"}]
["شنبه - 10-12 - 207","اقتصاد كلان\nروزانه - رفیعی",{"$f":"w!C3","v":"علوم اقتصادی"},{"$f":"w!D3","v":"برنامه ريزي سيستمهاي اقتصادي"},{"$f":"w!E3","v":"روزانه"},{"$f":"w!F3","v":"اقتصاد كلان"},{"$f":"w!I3","v":"رفیعی"},{"$f":"w!AB3","v":"شنبه"},{"$f":"w!AC3","v":"سه شنبه"},{"$f":"w!AE3","v":"10-12"},{"$f":"w!AF3","v":"15-17"},{"$f":"w!AH3","v":"207"},{"$f":"w!AI3","v":"208"}]
["شنبه - 15-17 - 207","تحلیل تصمیم گیری\nروزانه - کرمانی",{"$f":"w!C4","v":"علوم اقتصادی"},{"$f":"w!D4","v":"برنامه ريزي سيستمهاي اقتصادي"},{"$f":"w!E4","v":"روزانه"},{"$f":"w!F4","v":"تحلیل تصمیم گیری"},{"$f":"w!I4","v":"کرمانی"},{"$f":"w!AB4","v":"شنبه"},{"$f":"w!AC4","v":"سه شنبه"},{"$f":"w!AE4","v":"15-17"},{"$f":"w!AF4","v":"13-15"},{"$f":"w!AH4","v":"207"},{"$f":"w!AI4","v":"208"}]
["شنبه - 8-10 - 207","سيستمهاي ديناميكي1\nروزانه - پارسانژاد",{"$f":"w!C5","v":"علوم اقتصادی"},{"$f":"w!D5","v":"برنامه ريزي سيستمهاي اقتصادي"},{"$f":"w!E5","v":"روزانه"},{"$f":"w!F5","v":"سيستمهاي ديناميكي1"},{"$f":"w!I5","v":"پارسانژاد"},{"$f":"w!AB5","v":"شنبه"},{"$f":"w!AC5","v":"سه شنبه"},{"$f":"w!AE5","v":"8-10"},{"$f":"w!AF5","v":"8-10"},{"$f":"w!AH5","v":"207"},{"$f":"w!AI5","v":"207"}]
[" -  - ","پایان نامه\nروزانه - 0",{"$f":"w!C6","v":"علوم اقتصادی"},{"$f":"w!D6","v":"برنامه ريزي سيستمهاي اقتصادي"},{"$f":"w!E6","v":"روزانه"},{"$f":"w!F6","v":"پایان نامه"},{"$f":"w!I6","v":0},{"$f":"w!AB6","v":""},{"$f":"w!AC6","v":""},{"$f":"w!AE6","v":""},{"$f":"w!AF6","v":""},{"$f":"w!AH6","v":""},{"$f":"w!AI6","v":"-"}]
["شنبه - 8-10 - 208","اقتصاد خرد\nروزانه - رفیعی",{"$f":"w!C7","v":"علوم اقتصادی"},{"$f":"w!D7","v":"توسعه اقتصادي و برنامه ريزي"},{"$f":"w!E7","v":"روزانه"},{"$f":"w!F7","v":"اقتصاد خرد"},{"$f":"w!I7","v":"رفیعی"},{"$f":"w!AB7","v":"شنبه"},{"$f":"w!AC7","v":"دوشنبه"},{"$f":"w!AE7","v":"8-10"},{"$f":"w!AF7","v":"8-10"},{"$f":"w!AH7","v":"208"},{"$f":"w!AI7","v":"208"}]
["شنبه - 13-15 - 208","سیاستگذاری در بخش صنعت\nروزانه - محمدپور عمران",{"$f":"w!C8","v":"علوم اقتصادی"},{"$f":"w!D8","v":"توسعه اقتصادي و برنامه ريزي"},{"$f":"w!E8","v":"روزانه"},{"$f":"w!F8","v":"سیاستگذاری در بخش صنعت"},{"$f":"w!I8","v":"محمدپور عمران"},{"$f":"w!AB8","v":"شنبه"},{"$f":"w!AC8","v":"دوشنبه"},{"$f":"w!AE8","v":"13-15"},{"$f":"w!AF8","v":"13-15"},{"$f":"w!AH8","v":"208"},{"$f":"w!AI8","v":"208"}]
["شنبه - 15-17 - 208","اقتصاد كلان\nروزانه - ابوالحسنی",{"$f":"w!C9","v":"علوم اقتصادی"},{"$f":"w!D9","v":"توسعه اقتصادي و برنامه ريزي"},{"$f":"w!E9","v":"روزانه"},{"$f":"w!F9","v":"اقتصاد كلان"},{"$f":"w!I9","v":"ابوالحسنی"},{"$f":"w!AB9","v":"شنبه"},{"$f":"w!AC9","v":"دوشنبه"},{"$f":"w!AE9","v":"15-17"},{"$f":"w!AF9","v":"15-17"},{"$f":"w!AH9","v":"208"},{"$f":"w!AI9","v":"208"}]
[" -  - ","پایان نامه\nروزانه - 0",{"$f":"w!C10","v":"علوم اقتصادی"},{"$f":"w!D10","v":"توسعه اقتصادي و برنامه ريزي"},{"$f":"w!E10","v":"روزانه"},{"$f":"w!F10","v":"پایان نامه"},{"$f":"w!I10","v":0},{"$f":"w!AB10","v":""},{"$f":"w!AC10","v":""},{"$f":"w!AE10","v":""},{"$f":"w!AF10","v":""},{"$f":"w!AH10","v":""},{"$f":"w!AI10","v":"-"}]
["یکشنبه - 8-10 - 207","اقتصاد كلان پيشرفته\nروزانه - میرزامحمدی",{"$f":"w!C11","v":"مهندسي صنايع"},{"$f":"w!D11","v":"سيستمهاي كلان"},{"$f":"w!E11","v":"روزانه"},{"$f":"w!F11","v":"اقتصاد كلان پيشرفته"},{"$f":"w!I11","v":"میرزامحمدی"},{"$f":"w!AB11","v":"یکشنبه"},{"$f":"w!AC11","v":"سه شنبه"},{"$f":"w!AE11","v":"8-10"},{"$f":"w!AF11","v":"8-10"},{"$f":"w!AH11","v":"207"},{"$f":"w!AI11","v":"208"}]
["یکشنبه - 10-12 - 207","داده كاوي: مدلها، الگوريتمها و كاربردها\nروزانه - رسولی",{"$f":"w!C12","v":"مهندسي صنايع"},{"$f":"w!D12","v":"سيستمهاي كلان"},{"$f":"w!E12","v":"روزانه"},{"$f":"w!F12","v":"داده كاوي: مدلها، الگوريتمها و كاربردها"},{"$f":"w!I12","v":"رسولی"},{"$f":"w!AB12","v":"یکشنبه"},{"$f":"w!AC12","v":"سه شنبه"},{"$f":"w!AE12","v":"10-12"},{"$f":"w!AF12","v":"10-12"},{"$f":"w!AH12","v":"207"},{"$f":"w!AI12","v":"207"}]
["یکشنبه - 13-15 - 207","مدلسازي پوياييهاي سيستم\nروزانه - پارسانژاد",{"$f":"w!C13","v":"مهندسي صنايع"},{"$f":"w!D13","v":"سيستمهاي كلان"},{"$f":"w!E13","v":"روزانه"},{"$f":"w!F13","v":"مدلسازي پوياييهاي سيستم"},{"$f":"w!I13","v":"پارسانژاد"},{"$f":"w!AB13","v":"یکشنبه"},{"$f":"w!AC13","v":"سه شنبه"},{"$f":"w!AE13","v":"13-15"},{"$f":"w!AF13","v":"13-15"},{"$f":"w!AH13","v":"207"},{"$f":"w!AI13","v":"207"}]
["یکشنبه - 15-17 - 207","مفاهیم و مدلهای تحلیل شبکه های اجتماعی\nروزانه - کرمانی",{"$f":"w!C14","v":"مهندسي صنايع"},{"$f":"w!D14","v":"سيستمهاي كلان"},{"$f":"w!E14","v":"روزانه"},{"$f":"w!F14","v":"مفاهیم و مدلهای تحلیل شبکه های اجتماعی"},{"$f":"w!I14","v":"کرمانی"},{"$f":"w!AB14","v":"یکشنبه"},{"$f":"w!AC14","v":"سه شنبه"},{"$f":"w!AE14","v":"15-17"},{"$f":"w!AF14","v":"15-17"},{"$f":"w!AH14","v":"207"},{"$f":"w!AI14","v":"207"}]
[" -  - ","پایان نامه\nروزانه - 0",{"$f":"w!C15","v":"مهندسي صنايع"},{"$f":"w!D15","v":"سيستمهاي كلان"},{"$f":"w!E15","v":"روزانه"},{"$f":"w!F15","v":"پایان نامه"},{"$f":"w!I15","v":0},{"$f":"w!AB15","v":""},{"$f":"w!AC15","v":""},{"$f":"w!AE15","v":""},{"$f":"w!AF15","v":""},{"$f":"w!AH15","v":""},{"$f":"w!AI15","v":"-"}]
["چهارشنبه - 10-12 - 207","انتقال علم و فناوري\nروزانه و پردیس - منطقی",{"$f":"w!C16","v":"سياست گذاري علم و فناوري"},{"$f":"w!D16","v":"-"},{"$f":"w!E16","v":"روزانه و پردیس"},{"$f":"w!F16","v":"انتقال علم و فناوري"},{"$f":"w!I16","v":"منطقی"},{"$f":"w!AB16","v":"چهارشنبه"},{"$f":"w!AC16","v":""},{"$f":"w!AE16","v":"10-12"},{"$f":"w!AF16","v":""},{"$f":"w!AH16","v":"207"},{"$f":"w!AI16","v":"-"}]
["چهارشنبه - 8-10 - 207","علم ، فناوري و جامعه\nروزانه و پردیس - رفیعی",{"$f":"w!C17","v":"سياست گذاري علم و فناوري"},{"$f":"w!D17","v":"-"},{"$f":"w!E17","v":"روزانه و پردیس"},{"$f":"w!F17","v":"علم ، فناوري و جامعه"},{"$f":"w!I17","v":"رفیعی"},{"$f":"w!AB17","v":"چهارشنبه"},{"$f":"w!AC17","v":""},{"$f":"w!AE17","v":"8-10"},{"$f":"w!AF17","v":""},{"$f":"w!AH17","v":"207"},{"$f":"w!AI17","v":"-"}]
["چهارشنبه - 15-17 - 207","مدلهاي سياستگذاري علم و فناوري\nروزانه و پردیس - سیف الدین",{"$f":"w!C18","v":"سياست گذاري علم و فناوري"},{"$f":"w!D18","v":"-"},{"$f":"w!E18","v":"روزانه و پردیس"},{"$f":"w!F18","v":"مدلهاي سياستگذاري علم و فناوري"},{"$f":"w!I18","v":"سیف الدین"},{"$f":"w!AB18","v":"چهارشنبه"},{"$f":"w!AC18","v":""},{"$f":"w!AE18","v":"15-17"},{"$f":"w!AF18","v":""},{"$f":"w!AH18","v":"207"},{"$f":"w!AI18","v":"-"}]
["شنبه - 13-15 - 209","مديريت دانش و فناوري اطلاعات\nروزانه و پردیس - ذاکری",{"$f":"w!C19","v":"سياست گذاري علم و فناوري"},{"$f":"w!D19","v":"-"},{"$f":"w!E19","v":"روزانه و پردیس"},{"$f":"w!F19","v":"مديريت دانش و فناوري اطلاعات"},{"$f":"w!I19","v":"ذاکری"},{"$f":"w!AB19","v":"شنبه"},{"$f":"w!AC19","v":""},{"$f":"w!AE19","v":"13-15"},{"$f":"w!AF19","v":""},{"$f":"w!AH19","v":"209"},{"$f":"w!AI19","v":"-"}]
["چهارشنبه - 13-15 - 207","ارزیابی سرمایه گذاری و مدیریت ریسک فناوری\nروزانه و پردیس - شوال پور",{"$f":"w!C20","v":"سياست گذاري علم و فناوري"},{"$f":"w!D20","v":"-"},{"$f":"w!E20","v":"روزانه و پردیس"},{"$f":"w!F20","v":"ارزیابی سرمایه گذاری و مدیریت ریسک فناوری"},{"$f":"w!I20","v":"شوال پور"},{"$f":"w!AB20","v":"چهارشنبه"},{"$f":"w!AC20","v":""},{"$f":"w!AE20","v":"13-15"},{"$f":"w!AF20","v":""},{"$f":"w!AH20","v":"207"},{"$f":"w!AI20","v":"-"}]
["شنبه - 15-17 - آزم","مطالاعات گروهی\nروزانه و پردیس - رفیعی",{"$f":"w!C21","v":"سياست گذاري علم و فناوري"},{"$f":"w!D21","v":"-"},{"$f":"w!E21","v":"روزانه و پردیس"},{"$f":"w!F21","v":"مطالاعات گروهی"},{"$f":"w!I21","v":"رفیعی"},{"$f":"w!AB21","v":"شنبه"},{"$f":"w!AC21","v":""},{"$f":"w!AE21","v":"15-17"},{"$f":"w!AF21","v":""},{"$f":"w!AH21","v":"آزم"},{"$f":"w!AI21","v":"-"}]
["چهارشنبه - 10-12 - 208","الگوهاي تصميم گيري كارآفرينان\nروزانه - پارسانژاد",{"$f":"w!C22","v":"كارآفريني"},{"$f":"w!D22","v":"كسب و كار جديد"},{"$f":"w!E22","v":"روزانه"},{"$f":"w!F22","v":"الگوهاي تصميم گيري كارآفرينان"},{"$f":"w!I22","v":"پارسانژاد"},{"$f":"w!AB22","v":"چهارشنبه"},{"$f":"w!AC22","v":""},{"$f":"w!AE22","v":"10-12"},{"$f":"w!AF22","v":""},{"$f":"w!AH22","v":"208"},{"$f":"w!AI22","v":"-"}]
["یکشنبه - 13-15 - 208","بازاريابي خدمات\nروزانه - حمیدی زاده",{"$f":"w!C23","v":"كارآفريني"},{"$f":"w!D23","v":"كسب و كار جديد"},{"$f":"w!E23","v":"روزانه"},{"$f":"w!F23","v":"بازاريابي خدمات"},{"$f":"w!I23","v":"حمیدی زاده"},{"$f":"w!AB23","v":"یکشنبه"},{"$f":"w!AC23","v":""},{"$f":"w!AE23","v":"13-15"},{"$f":"w!AF23","v":""},{"$f":"w!AH23","v":"208"},{"$f":"w!AI23","v":"-"}]
["یکشنبه - 8-10 - 208","تشخيص فرصت هاي كارآفريني\nروزانه - صالحی",{"$f":"w!C24","v":"كارآفريني"},{"$f":"w!D24","v":"كسب و كار جديد"},{"$f":"w!E24","v":"روزانه"},{"$f":"w!F24","v":"تشخيص فرصت هاي كارآفريني"},{"$f":"w!I24","v":"صالحی"},{"$f":"w!AB24","v":"یکشنبه"},{"$f":"w!AC24","v":""},{"$f":"w!AE24","v":"8-10"},{"$f":"w!AF24","v":""},{"$f":"w!AH24","v":"208"},{"$f":"w!AI24","v":"-"}]
["یکشنبه - 10-12 - 208","تئوريهاي مديريت پيشرفته\nروزانه - عبدالحمید",{"$f":"w!C25","v":"كارآفريني"},{"$f":"w!D25","v":"كسب و كار جديد"},{"$f":"w!E25","v":"روزانه"},{"$f":"w!F25","v":"تئوريهاي مديريت پيشرفته"},{"$f":"w!I25","v":"عبدالحمید"},{"$f":"w!AB25","v":"یکشنبه"},{"$f":"w!AC25","v":""},{"$f":"w!AE25","v":"10-12"},{"$f":"w!AF25","v":""},{"$f":"w!AH25","v":"208"},{"$f":"w!AI25","v":"-"}]
["چهارشنبه - 8-10 - 208","كارآفريني در بستر فناوري اطلاعات\nروزانه - خانی زاد",{"$f":"w!C26","v":"كارآفريني"},{"$f":"w!D26","v":"كسب و كار جديد"},{"$f":"w!E26","v":"روزانه"},{"$f":"w!F26","v":"كارآفريني در بستر فناوري اطلاعات"},{"$f":"w!I26","v":"خانی زاد"},{"$f":"w!AB26","v":"چهارشنبه"},{"$f":"w!AC26","v":""},{"$f":"w!AE26","v":"8-10"},{"$f":"w!AF26","v":""},{"$f":"w!AH26","v":"208"},{"$f":"w!AI26","v":"-"}]
["یکشنبه - 15-17 - 208","مديريت زنجيره تامين\nروزانه - تیموری",{"$f":"w!C27","v":"كارآفريني"},{"$f":"w!D27","v":"كسب و كار جديد"},{"$f":"w!E27","v":"روزانه"},{"$f":"w!F27","v":"مديريت زنجيره تامين"},{"$f":"w!I27","v":"تیموری"},{"$f":"w!AB27","v":"یکشنبه"},{"$f":"w!AC27","v":""},{"$f":"w!AE27","v":"15-17"},{"$f":"w!AF27","v":""},{"$f":"w!AH27","v":"208"},{"$f":"w!AI27","v":"-"}]
["سه شنبه - 10-12 - 213","مباحث منتخب\nروزانه - پارسانژاد",{"$f":"w!C28","v":"كارآفريني"},{"$f":"w!D28","v":"كسب و كار جديد"},{"$f":"w!E28","v":"روزانه"},{"$f":"w!F28","v":"مباحث منتخب"},{"$f":"w!I28","v":"پارسانژاد"},{"$f":"w!AB28","v":"سه شنبه"},{"$f":"w!AC28","v":""},{"$f":"w!AE28","v":"10-12"},{"$f":"w!AF28","v":""},{"$f":"w!AH28","v":"213"},{"$f":"w!AI28","v":"-"}]
[" -  - ","پایان نامه\nروزانه - 0",{"$f":"w!C29","v":"كارآفريني"},{"$f":"w!D29","v":"كسب و كار جديد"},{"$f":"w!E29","v":"روزانه"},{"$f":"w!F29","v":"پایان نامه"},{"$f":"w!I29","v":0},{"$f":"w!AB29","v":""},{"$f":"w!AC29","v":""},{"$f":"w!AE29","v":""},{"$f":"w!AF29","v":""},{"$f":"w!AH29","v":""},{"$f":"w!AI29","v":"-"}]
["پنج شنبه - 8-10 - 207","سيستمهاي يكپارچه كسب و كار الكترونيك\nپردیس - وحیدی",{"$f":"w!C30","v":"مديريت فناوري اطلاعات"},{"$f":"w!D30","v":"كسب و كار الكترونيك"},{"$f":"w!E30","v":"پردیس"},{"$f":"w!F30","v":"سيستمهاي يكپارچه كسب و كار الكترونيك"},{"$f":"w!I30","v":"وحیدی"},{"$f":"w!AB30","v":"پنج شنبه"},{"$f":"w!AC30","v":""},{"$f":"w!AE30","v":"8-10"},{"$f":"w!AF30","v":""},{"$f":"w!AH30","v":"207"},{"$f":"w!AI30","v":"-"}]
["چهارشنبه - 15-17 - 208","سيستمهاي يكپارچه كسب و كار الكترونيك\nروزانه - وحیدی",{"$f":"w!C31","v":"مديريت فناوري اطلاعات"},{"$f":"w!D31","v":"كسب و كار الكترونيك"},{"$f":"w!E31","v":"روزانه"},{"$f":"w!F31","v":"سيستمهاي يكپارچه كسب و كار الكترونيك"},{"$f":"w!I31","v":"وحیدی"},{"$f":"w!AB31","v":"چهارشنبه"},{"$f":"w!AC31","v":""},{"$f":"w!AE31","v":"15-17"},{"$f":"w!AF31","v":""},{"$f":"w!AH31","v":"208"},{"$f":"w!AI31","v":"-"}]
["چهارشنبه - 13-15 - 208","مباني تئوري و فلسفي سيستمهاي اطلاعاتي\nپردیس - رفیعی آتانی",{"$f":"w!C32","v":"مديريت فناوري اطلاعات"},{"$f":"w!D32","v":"كسب و كار الكترونيك"},{"$f":"w!E32","v":"پردیس"},{"$f":"w!F32","v":"مباني تئوري و فلسفي سيستمهاي اطلاعاتي"},{"$f":"w!I32","v":"رفیعی آتانی"},{"$f":"w!AB32","v":"چهارشنبه"},{"$f":"w!AC32","v":""},{"$f":"w!AE32","v":"13-15"},{"$f":"w!AF32","v":""},{"$f":"w!AH32","v":"208"},{"$f":"w!AI32","v":"-"}]
["دوشنبه - 10-12 - 207","مباني تئوري و فلسفي سيستمهاي اطلاعاتي\nروزانه - رفیعی آتانی",{"$f":"w!C33","v":"مديريت فناوري اطلاعات"},{"$f":"w!D33","v":"كسب و كار الكترونيك"},{"$f":"w!E33","v":"روزانه"},{"$f":"w!F33","v":"مباني تئوري و فلسفي سيستمهاي اطلاعاتي"},{"$f":"w!I33","v":"رفیعی آتانی"},{"$f":"w!AB33","v":"دوشنبه"},{"$f":"w!AC33","v":""},{"$f":"w!AE33","v":"10-12"},{"$f":"w!AF33","v":""},{"$f":"w!AH33","v":"207"},{"$f":"w!AI33","v":"-"}]
[{"$f":"CONCATENATE(H34,\" - \",J34,\" - \",L34)","v":"چهارشنبه - 10-12 - 209"},{"$f":"CONCATENATE(F34,CHAR(10),E34,\" - \",G34)","v":"مدلهاي كسب و كار الكترونيك\nپردیس - صالحی"},{"$f":"w!C34","v":"مديريت فناوري اطلاعات"},{"$f":"w!D34","v":"كسب و كار الكترونيك"},{"$f":"w!E34","v":"پردیس"},{"$f":"w!F34","v":"مدلهاي كسب و كار الكترونيك"},{"$f":"w!I34","v":"صالحی"},{"$f":"w!AB34","v":"چهارشنبه"},{"$f":"w!AC34","v":""},{"$f":"w!AE34","v":"10-12"},{"$f":"w!AF34","v":""},{"$f":"w!AH34","v":"209"},{"$f":"w!AI34","v":"-"}]
["دوشنبه - 8-10 - 207","مدلهاي كسب و كار الكترونيك\nروزانه - صالحی",{"$f":"w!C35","v":"مديريت فناوري اطلاعات"},{"$f":"w!D35","v":"كسب و كار الكترونيك"},{"$f":"w!E35","v":"روزانه"},{"$f":"w!F35","v":"مدلهاي كسب و كار الكترونيك"},{"$f":"w!I35","v":"صالحی"},{"$f":"w!AB35","v":"دوشنبه"},{"$f":"w!AC35","v":""},{"$f":"w!AE35","v":"8-10"},{"$f":"w!AF35","v":""},{"$f":"w!AH35","v":"207"},{"$f":"w!AI35","v":"-"}]
["چهارشنبه - 15-17 - 209","مديريت استراتژيك سيستمهاي اطلاعاتي\nپردیس - ذاکری",{"$f":"w!C36","v":"مديريت فناوري اطلاعات"},{"$f":"w!D36","v":"كسب و كار الكترونيك"},{"$f":"w!E36","v":"پردیس"},{"$f":"w!F36","v":"مديريت استراتژيك سيستمهاي اطلاعاتي"},{"$f":"w!I36","v":"ذاکری"},{"$f":"w!AB36","v":"چهارشنبه"},{"$f":"w!AC36","v":""},{"$f":"w!AE36","v":"15-17"},{"$f":"w!AF36","v":""},{"$f":"w!AH36","v":"209"},{"$f":"w!AI36","v":"-"}]
["چهارشنبه - 8-10 - 209","مديريت استراتژيك سيستمهاي اطلاعاتي\nروزانه - ذاکری",{"$f":"w!C37","v":"مديريت فناوري اطلاعات"},{"$f":"w!D37","v":"كسب و كار الكترونيك"},{"$f":"w!E37","v":"روزانه"},{"$f":"w!F37","v":"مديريت استراتژيك سيستمهاي اطلاعاتي"},{"$f":"w!I37","v":"ذاکری"},{"$f":"w!AB37","v":"چهارشنبه"},{"$f":"w!AC37","v":""},{"$f":"w!AE37","v":"8-10"},{"$f":"w!AF37","v":""},{"$f":"w!AH37","v":"209"},{"$f":"w!AI37","v":"-"}]
["پنج شنبه - 10-12 - 207","مديريت امنيت فناوري اطلاعات\nپردیس - خانی زاد",{"$f":"w!C38","v":"مديريت فناوري اطلاعات"},{"$f":"w!D38","v":"كسب و كار الكترونيك"},{"$f":"w!E38","v":"پردیس"},{"$f":"w!F38","v":"مديريت امنيت فناوري اطلاعات"},{"$f":"w!I38","v":"خانی زاد"},{"$f":"w!AB38","v":"پنج شنبه"},{"$f":"w!AC38","v":""},{"$f":"w!AE38","v":"10-12"},{"$f":"w!AF38","v":""},{"$f":"w!AH38","v":"207"},{"$f":"w!AI38","v":"-"}]
["دوشنبه - 15-17 - 207","مديريت امنيت فناوري اطلاعات\nروزانه - خانی زاد",{"$f":"w!C39","v":"مديريت فناوري اطلاعات"},{"$f":"w!D39","v":"كسب و كار الكترونيك"},{"$f":"w!E39","v":"روزانه"},{"$f":"w!F39","v":"مديريت امنيت فناوري اطلاعات"},{"$f":"w!I39","v":"خانی زاد"},{"$f":"w!AB39","v":"دوشنبه"},{"$f":"w!AC39","v":""},{"$f":"w!AE39","v":"15-17"},{"$f":"w!AF39","v":""},{"$f":"w!AH39","v":"207"},{"$f":"w!AI39","v":"-"}]
[" -  - ","پایان نامه\nپردیس - 0",{"$f":"w!C40","v":"مديريت فناوري اطلاعات"},{"$f":"w!D40","v":"كسب و كار الكترونيك"},{"$f":"w!E40","v":"پردیس"},{"$f":"w!F40","v":"پایان نامه"},{"$f":"w!I40","v":0},{"$f":"w!AB40","v":""},{"$f":"w!AC40","v":""},{"$f":"w!AE40","v":""},{"$f":"w!AF40","v":""},{"$f":"w!AH40","v":""},{"$f":"w!AI40","v":"-"}]
[" -  - ","پایان نامه\nروزانه - 0",{"$f":"w!C41","v":"مديريت فناوري اطلاعات"},{"$f":"w!D41","v":"كسب و كار الكترونيك"},{"$f":"w!E41","v":"روزانه"},{"$f":"w!F41","v":"پایان نامه"},{"$f":"w!I41","v":0},{"$f":"w!AB41","v":""},{"$f":"w!AC41","v":""},{"$f":"w!AE41","v":""},{"$f":"w!AF41","v":""},{"$f":"w!AH41","v":""},{"$f":"w!AI41","v":"-"}]
["شنبه - 15-17 - 210","ارزيابي تكنولوژي\nروزانه - شوال پور",{"$f":"w!C42","v":"مديريت تكنولوژي"},{"$f":"w!D42","v":"نوآوري تكنولوژي - سياست هاي تحقيق و توسعه"},{"$f":"w!E42","v":"روزانه"},{"$f":"w!F42","v":"ارزيابي تكنولوژي"},{"$f":"w!I42","v":"شوال پور"},{"$f":"w!AB42","v":"شنبه"},{"$f":"w!AC42","v":""},{"$f":"w!AE42","v":"15-17"},{"$f":"w!AF42","v":""},{"$f":"w!AH42","v":"210"},{"$f":"w!AI42","v":"-"}]
["شنبه - 13-15 - 210","پروژه ترم\nروزانه - عبدالحمید",{"$f":"w!C43","v":"مديريت تكنولوژي"},{"$f":"w!D43","v":"نوآوري تكنولوژي - سياست هاي تحقيق و توسعه"},{"$f":"w!E43","v":"روزانه"},{"$f":"w!F43","v":"پروژه ترم"},{"$f":"w!I43","v":"عبدالحمید"},{"$f":"w!AB43","v":"شنبه"},{"$f":"w!AC43","v":""},{"$f":"w!AE43","v":"13-15"},{"$f":"w!AF43","v":""},{"$f":"w!AH43","v":"210"},{"$f":"w!AI43","v":"-"}]
["شنبه - 10-12 - سای","پيش بيني تكنولوژي\nروزانه - شفیعا",{"$f":"w!C44","v":"مديريت تكنولوژي"},{"$f":"w!D44","v":"نوآوري تكنولوژي - سياست هاي تحقيق و توسعه"},{"$f":"w!E44","v":"روزانه"},{"$f":"w!F44","v":"پيش بيني تكنولوژي"},{"$f":"w!I44","v":"شفیعا"},{"$f":"w!AB44","v":"شنبه"},{"$f":"w!AC44","v":""},{"$f":"w!AE44","v":"10-12"},{"$f":"w!AF44","v":""},{"$f":"w!AH44","v":"سای"},{"$f":"w!AI44","v":"-"}]
["چهارشنبه - 8-10 - 210","نظام ملی نوآوری\nروزانه - صالحی",{"$f":"w!C45","v":"مديريت تكنولوژي"},{"$f":"w!D45","v":"نوآوري تكنولوژي - سياست هاي تحقيق و توسعه"},{"$f":"w!E45","v":"روزانه"},{"$f":"w!F45","v":"نظام ملی نوآوری"},{"$f":"w!I45","v":"صالحی"},{"$f":"w!AB45","v":"چهارشنبه"},{"$f":"w!AC45","v":""},{"$f":"w!AE45","v":"8-10"},{"$f":"w!AF45","v":""},{"$f":"w!AH45","v":"210"},{"$f":"w!AI45","v":"-"}]
["چهارشنبه - 10-12 - 210","مديريت رفتار سازماني پيشرفته\nروزانه - بنیادی",{"$f":"w!C46","v":"مديريت تكنولوژي"},{"$f":"w!D46","v":"نوآوري تكنولوژي - سياست هاي تحقيق و توسعه"},{"$f":"w!E46","v":"روزانه"},{"$f":"w!F46","v":"مديريت رفتار سازماني پيشرفته"},{"$f":"w!I46","v":"بنیادی"},{"$f":"w!AB46","v":"چهارشنبه"},{"$f":"w!AC46","v":""},{"$f":"w!AE46","v":"10-12"},{"$f":"w!AF46","v":""},{"$f":"w!AH46","v":"210"},{"$f":"w!AI46","v":"-"}]
[" -  - ","پايان نامه\nروزانه - 0",{"$f":"w!C47","v":"مديريت تكنولوژي"},{"$f":"w!D47","v":"نوآوري تكنولوژي - سياست هاي تحقيق و توسعه"},{"$f":"w!E47","v":"روزانه"},{"$f":"w!F47","v":"پايان نامه"},{"$f":"w!I47","v":0},{"$f":"w!AB47","v":""},{"$f":"w!AC47","v":""},{"$f":"w!AE47","v":""},{"$f":"w!AF47","v":""},{"$f":"w!AH47","v":""},{"$f":"w!AI47","v":"-"}]
["چهارشنبه - 8-10 - 213","توانايي هاي نوآوري\nروزانه و پردیس - منطقی",{"$f":"w!C48","v":"مديريت تكنولوژي"},{"$f":"w!D48","v":"مديريت نوآوري"},{"$f":"w!E48","v":"روزانه و پردیس"},{"$f":"w!F48","v":"توانايي هاي نوآوري"},{"$f":"w!I48","v":"منطقی"},{"$f":"w!AB48","v":"چهارشنبه"},{"$f":"w!AC48","v":""},{"$f":"w!AE48","v":"8-10"},{"$f":"w!AF48","v":""},{"$f":"w!AH48","v":"213"},{"$f":"w!AI48","v":"-"}]
["چهارشنبه - 13-15 - 209","فرايند نوآوري و تجربه كشورهاي پيشرفته\nروزانه و پردیس - بنیادی",{"$f":"w!C49","v":"مديريت تكنولوژي"},{"$f":"w!D49","v":"مديريت نوآوري"},{"$f":"w!E49","v":"روزانه و پردیس"},{"$f":"w!F49","v":"فرايند نوآوري و تجربه كشورهاي پيشرفته"},{"$f":"w!I49","v":"بنیادی"},{"$f":"w!AB49","v":"چهارشنبه"},{"$f":"w!AC49","v":""},{"$f":"w!AE49","v":"13-15"},{"$f":"w!AF49","v":""},{"$f":"w!AH49","v":"209"},{"$f":"w!AI49","v":"-"}]
["شنبه - 8-10 - 209","مباني استراتژيهاي توسعه تكنولوژي\nروزانه و پردیس - شوال پور",{"$f":"w!C50","v":"مديريت تكنولوژي"},{"$f":"w!D50","v":"مديريت نوآوري"},{"$f":"w!E50","v":"روزانه و پردیس"},{"$f":"w!F50","v":"مباني استراتژيهاي توسعه تكنولوژي"},{"$f":"w!I50","v":"شوال پور"},{"$f":"w!AB50","v":"شنبه"},{"$f":"w!AC50","v":""},{"$f":"w!AE50","v":"8-10"},{"$f":"w!AF50","v":""},{"$f":"w!AH50","v":"209"},{"$f":"w!AI50","v":"-"}]
["چهارشنبه - 10-12 - 213","مباني نظريه هاي اقتصاددانان كلاسيك و نئوكلاسيك و نظريه پردازان جديد در زمينه توسعه تكنولوژي و سير تح\nروزانه و پردیس - میرزامحمدی",{"$f":"w!C51","v":"مديريت تكنولوژي"},{"$f":"w!D51","v":"مديريت نوآوري"},{"$f":"w!E51","v":"روزانه و پردیس"},{"$f":"w!F51","v":"مباني نظريه هاي اقتصاددانان كلاسيك و نئوكلاسيك و نظريه پردازان جديد در زمينه توسعه تكنولوژي و سير تح"},{"$f":"w!I51","v":"میرزامحمدی"},{"$f":"w!AB51","v":"چهارشنبه"},{"$f":"w!AC51","v":""},{"$f":"w!AE51","v":"10-12"},{"$f":"w!AF51","v":""},{"$f":"w!AH51","v":"213"},{"$f":"w!AI51","v":"-"}]
["شنبه - 15-17 - آزم","مطالاعات گروهی\nروزانه و پردیس - رفیعی",{"$f":"w!C52","v":"مديريت تكنولوژي"},{"$f":"w!D52","v":"مديريت نوآوري"},{"$f":"w!E52","v":"روزانه و پردیس"},{"$f":"w!F52","v":"مطالاعات گروهی"},{"$f":"w!I52","v":"رفیعی"},{"$f":"w!AB52","v":"شنبه"},{"$f":"w!AC52","v":""},{"$f":"w!AE52","v":"15-17"},{"$f":"w!AF52","v":""},{"$f":"w!AH52","v":"آزم"},{"$f":"w!AI52","v":"-"}]
["شنبه - 8-10 - 209","اجرا و ارزيابي خط مشي هاي عمومي در ايران\nروزانه و پردیس - عبدالحمید",{"$f":"w!C53","v":"مديريت سازمان هاي دولتي ايران"},{"$f":"w!D53","v":"سياستگذاري دولتي(خط مشي گذاري عمومي)"},{"$f":"w!E53","v":"روزانه و پردیس"},{"$f":"w!F53","v":"اجرا و ارزيابي خط مشي هاي عمومي در ايران"},{"$f":"w!I53","v":"عبدالحمید"},{"$f":"w!AB53","v":"شنبه"},{"$f":"w!AC53","v":""},{"$f":"w!AE53","v":"8-10"},{"$f":"w!AF53","v":""},{"$f":"w!AH53","v":"209"},{"$f":"w!AI53","v":"-"}]
["شنبه - 10-12 - 209","مبانی پژوهشی قرآن و مفاهیم مدیریتی در قرآن (تفسیر)\nروزانه و پردیس - معینی",{"$f":"w!C54","v":"مديريت سازمان هاي دولتي ايران"},{"$f":"w!D54","v":"سياستگذاري دولتي(خط مشي گذاري عمومي)"},{"$f":"w!E54","v":"روزانه و پردیس"},{"$f":"w!F54","v":"مبانی پژوهشی قرآن و مفاهیم مدیریتی در قرآن (تفسیر)"},{"$f":"w!I54","v":"معینی"},{"$f":"w!AB54","v":"شنبه"},{"$f":"w!AC54","v":""},{"$f":"w!AE54","v":"10-12"},{"$f":"w!AF54","v":""},{"$f":"w!AH54","v":"209"},{"$f":"w!AI54","v":"-"}]
["شنبه - 13-15 - 213","مبانی فلسفی اداره امور عمومی از دیدگاه اسلام\nروزانه و پردیس - رفیعی",{"$f":"w!C55","v":"مديريت سازمان هاي دولتي ايران"},{"$f":"w!D55","v":"سياستگذاري دولتي(خط مشي گذاري عمومي)"},{"$f":"w!E55","v":"روزانه و پردیس"},{"$f":"w!F55","v":"مبانی فلسفی اداره امور عمومی از دیدگاه اسلام"},{"$f":"w!I55","v":"رفیعی"},{"$f":"w!AB55","v":"شنبه"},{"$f":"w!AC55","v":""},{"$f":"w!AE55","v":"13-15"},{"$f":"w!AF55","v":""},{"$f":"w!AH55","v":"213"},{"$f":"w!AI55","v":"-"}]
["شنبه - 8-10 - 210","حقوق اداری و سازمان نظام ج ا ا\nروزانه و پردیس - موسی زاده",{"$f":"w!C56","v":"مديريت سازمان هاي دولتي ايران"},{"$f":"w!D56","v":"سياستگذاري دولتي(خط مشي گذاري عمومي)"},{"$f":"w!E56","v":"روزانه و پردیس"},{"$f":"w!F56","v":"حقوق اداری و سازمان نظام ج ا ا"},{"$f":"w!I56","v":"موسی زاده"},{"$f":"w!AB56","v":"شنبه"},{"$f":"w!AC56","v":""},{"$f":"w!AE56","v":"8-10"},{"$f":"w!AF56","v":""},{"$f":"w!AH56","v":"210"},{"$f":"w!AI56","v":"-"}]
["دوشنبه - 10-12 - 208","نظريه هاي خط مشي گذاري عمومي با رويكرد تطبيقي (اسلام و معاصر)\nروزانه و پردیس - علی احمدی",{"$f":"w!C57","v":"مديريت سازمان هاي دولتي ايران"},{"$f":"w!D57","v":"سياستگذاري دولتي(خط مشي گذاري عمومي)"},{"$f":"w!E57","v":"روزانه و پردیس"},{"$f":"w!F57","v":"نظريه هاي خط مشي گذاري عمومي با رويكرد تطبيقي (اسلام و معاصر)"},{"$f":"w!I57","v":"علی احمدی"},{"$f":"w!AB57","v":"دوشنبه"},{"$f":"w!AC57","v":""},{"$f":"w!AE57","v":"10-12"},{"$f":"w!AF57","v":""},{"$f":"w!AH57","v":"208"},{"$f":"w!AI57","v":"-"}]
[" -  - ","مطالاعات گروهی\nروزانه و پردیس - رفیعی",{"$f":"w!C58","v":"مديريت سازمان هاي دولتي ايران"},{"$f":"w!D58","v":"سياستگذاري دولتي(خط مشي گذاري عمومي)"},{"$f":"w!E58","v":"روزانه و پردیس"},{"$f":"w!F58","v":"مطالاعات گروهی"},{"$f":"w!I58","v":"رفیعی"},{"$f":"w!AB58","v":""},{"$f":"w!AC58","v":""},{"$f":"w!AE58","v":""},{"$f":"w!AF58","v":""},{"$f":"w!AH58","v":""},{"$f":"w!AI58","v":"-"}]
["چهارشنبه - 13-16 - 213","اخلاق و احكام كسب و كار\nپردیس - عبدالحمید",{"$f":"w!C59","v":"مديريت كسب و كار"},{"$f":"w!D59","v":"بازاريابي - استراتژي"},{"$f":"w!E59","v":"پردیس"},{"$f":"w!F59","v":"اخلاق و احكام كسب و كار"},{"$f":"w!I59","v":"عبدالحمید"},{"$f":"w!AB59","v":"چهارشنبه"},{"$f":"w!AC59","v":""},{"$f":"w!AE59","v":"13-16"},{"$f":"w!AF59","v":""},{"$f":"w!AH59","v":"213"},{"$f":"w!AI59","v":"-"}]
["یکشنبه - 15-17 - 209","اخلاق و احكام كسب و كار\nروزانه - معینی",{"$f":"w!C60","v":"مديريت كسب و كار"},{"$f":"w!D60","v":"بازاريابي - استراتژي"},{"$f":"w!E60","v":"روزانه"},{"$f":"w!F60","v":"اخلاق و احكام كسب و كار"},{"$f":"w!I60","v":"معینی"},{"$f":"w!AB60","v":"یکشنبه"},{"$f":"w!AC60","v":"سه شنبه"},{"$f":"w!AE60","v":"15-17"},{"$f":"w!AF60","v":"13-15"},{"$f":"w!AH60","v":"209"},{"$f":"w!AI60","v":"209"}]
["چهارشنبه - 16-19 - 210","اصول اقتصاد\nپردیس - میرزامحمدی",{"$f":"w!C61","v":"مديريت كسب و كار"},{"$f":"w!D61","v":"بازاريابي - استراتژي"},{"$f":"w!E61","v":"پردیس"},{"$f":"w!F61","v":"اصول اقتصاد"},{"$f":"w!I61","v":"میرزامحمدی"},{"$f":"w!AB61","v":"چهارشنبه"},{"$f":"w!AC61","v":""},{"$f":"w!AE61","v":"16-19"},{"$f":"w!AF61","v":""},{"$f":"w!AH61","v":"210"},{"$f":"w!AI61","v":"-"}]
["یکشنبه - 10-12 - 209","اصول اقتصاد\nروزانه - حکیمی پور",{"$f":"w!C62","v":"مديريت كسب و كار"},{"$f":"w!D62","v":"بازاريابي - استراتژي"},{"$f":"w!E62","v":"روزانه"},{"$f":"w!F62","v":"اصول اقتصاد"},{"$f":"w!I62","v":"حکیمی پور"},{"$f":"w!AB62","v":"یکشنبه"},{"$f":"w!AC62","v":"سه شنبه"},{"$f":"w!AE62","v":"10-12"},{"$f":"w!AF62","v":"10-12"},{"$f":"w!AH62","v":"209"},{"$f":"w!AI62","v":"209"}]
["چهارشنبه - 10-13 - ","تصميم گيري براي مديران\nپردیس - سبحانی فرد",{"$f":"w!C63","v":"مديريت كسب و كار"},{"$f":"w!D63","v":"بازاريابي - استراتژي"},{"$f":"w!E63","v":"پردیس"},{"$f":"w!F63","v":"تصميم گيري براي مديران"},{"$f":"w!I63","v":"سبحانی فرد"},{"$f":"w!AB63","v":"چهارشنبه"},{"$f":"w!AC63","v":""},{"$f":"w!AE63","v":"10-13"},{"$f":"w!AF63","v":""},{"$f":"w!AH63","v":""},{"$f":"w!AI63","v":"-"}]
["یکشنبه - 13-15 - 209","تصميم گيري براي مديران\nروزانه - سبحانی فرد",{"$f":"w!C64","v":"مديريت كسب و كار"},{"$f":"w!D64","v":"بازاريابي - استراتژي"},{"$f":"w!E64","v":"روزانه"},{"$f":"w!F64","v":"تصميم گيري براي مديران"},{"$f":"w!I64","v":"سبحانی فرد"},{"$f":"w!AB64","v":"یکشنبه"},{"$f":"w!AC64","v":"سه شنبه"},{"$f":"w!AE64","v":"13-15"},{"$f":"w!AF64","v":"15-17"},{"$f":"w!AH64","v":"209"},{"$f":"w!AI64","v":"209"}]
["یکشنبه - 7-10 - 213","مدیریت مالی\nروزانه - بیات",{"$f":"w!C65","v":"مديريت كسب و كار"},{"$f":"w!D65","v":"بازاريابي - استراتژي"},{"$f":"w!E65","v":"روزانه"},{"$f":"w!F65","v":"مدیریت مالی"},{"$f":"w!I65","v":"بیات"},{"$f":"w!AB65","v":"یکشنبه"},{"$f":"w!AC65","v":""},{"$f":"w!AE65","v":"7-10"},{"$f":"w!AF65","v":""},{"$f":"w!AH65","v":"213"},{"$f":"w!AI65","v":"-"}]
[{"$f":"CONCATENATE(H66,\" - \",J66,\" - \",L66)","v":"چهارشنبه - 7-10 - 209"},{"$f":"CONCATENATE(F66,CHAR(10),E66,\" - \",G66)","v":"مديريت رفتار سازماني\nپردیس - بنیادی"},{"$f":"w!C66","v":"مديريت كسب و كار"},{"$f":"w!D66","v":"بازاريابي - استراتژي"},{"$f":"w!E66","v":"پردیس"},{"$f":"w!F66","v":"مديريت رفتار سازماني"},{"$f":"w!I66","v":"بنیادی"},{"$f":"w!AB66","v":"چهارشنبه"},{"$f":"w!AC66","v":""},{"$f":"w!AE66","v":"7-10"},{"$f":"w!AF66","v":""},{"$f":"w!AH66","v":"209"},{"$f":"w!AI66","v":"-"}]
["یکشنبه - 8-10 - 209","مديريت رفتار سازماني\nروزانه - بنیادی",{"$f":"w!C67","v":"مديريت كسب و كار"},{"$f":"w!D67","v":"بازاريابي - استراتژي"},{"$f":"w!E67","v":"روزانه"},{"$f":"w!F67","v":"مديريت رفتار سازماني"},{"$f":"w!I67","v":"بنیادی"},{"$f":"w!AB67","v":"یکشنبه"},{"$f":"w!AC67","v":"سه شنبه"},{"$f":"w!AE67","v":"8-10"},{"$f":"w!AF67","v":"8-10"},{"$f":"w!AH67","v":"209"},{"$f":"w!AI67","v":"209"}]
["سه شنبه - 15-18 - 210","تجارت الکترونیک\nروزانه - فتحیان",{"$f":"w!C68","v":"مديريت كسب و كار"},{"$f":"w!D68","v":"بازاريابي"},{"$f":"w!E68","v":"روزانه"},{"$f":"w!F68","v":"تجارت الکترونیک"},{"$f":"w!I68","v":"فتحیان"},{"$f":"w!AB68","v":"سه شنبه"},{"$f":"w!AC68","v":""},{"$f":"w!AE68","v":"15-18"},{"$f":"w!AF68","v":""},{"$f":"w!AH68","v":"210"},{"$f":"w!AI68","v":"-"}]
["یکشنبه - 15-17 - 210","رفتار مصرف کننده\nروزانه - سبحانی فرد",{"$f":"w!C69","v":"مديريت كسب و كار"},{"$f":"w!D69","v":"بازاريابي"},{"$f":"w!E69","v":"روزانه"},{"$f":"w!F69","v":"رفتار مصرف کننده"},{"$f":"w!I69","v":"سبحانی فرد"},{"$f":"w!AB69","v":"یکشنبه"},{"$f":"w!AC69","v":"سه شنبه"},{"$f":"w!AE69","v":"15-17"},{"$f":"w!AF69","v":"13-15"},{"$f":"w!AH69","v":"210"},{"$f":"w!AI69","v":"210"}]
["پنج شنبه - 10-13 - 208","تحقیقات بازاریابی\nپردیس - حمیدی زاده",{"$f":"w!C70","v":"مديريت كسب و كار"},{"$f":"w!D70","v":"بازاريابي"},{"$f":"w!E70","v":"پردیس"},{"$f":"w!F70","v":"تحقیقات بازاریابی"},{"$f":"w!I70","v":"حمیدی زاده"},{"$f":"w!AB70","v":"پنج شنبه"},{"$f":"w!AC70","v":""},{"$f":"w!AE70","v":"10-13"},{"$f":"w!AF70","v":""},{"$f":"w!AH70","v":"208"},{"$f":"w!AI70","v":"-"}]
["یکشنبه - 10-13 - 210","تحقیقات بازاریابی\nروزانه - حمیدی زاده",{"$f":"w!C71","v":"مديريت كسب و كار"},{"$f":"w!D71","v":"بازاريابي"},{"$f":"w!E71","v":"روزانه"},{"$f":"w!F71","v":"تحقیقات بازاریابی"},{"$f":"w!I71","v":"حمیدی زاده"},{"$f":"w!AB71","v":"یکشنبه"},{"$f":"w!AC71","v":""},{"$f":"w!AE71","v":"10-13"},{"$f":"w!AF71","v":""},{"$f":"w!AH71","v":"210"},{"$f":"w!AI71","v":"-"}]
["پنج شنبه - 14-17 - 207","مديريت عملیات\nپردیس - محمدی",{"$f":"w!C72","v":"مديريت كسب و كار"},{"$f":"w!D72","v":"بازاريابي - استراتژي"},{"$f":"w!E72","v":"پردیس"},{"$f":"w!F72","v":"مديريت عملیات"},{"$f":"w!I72","v":"محمدی"},{"$f":"w!AB72","v":"پنج شنبه"},{"$f":"w!AC72","v":""},{"$f":"w!AE72","v":"14-17"},{"$f":"w!AF72","v":""},{"$f":"w!AH72","v":"207"},{"$f":"w!AI72","v":"-"}]
["یکشنبه - 7-10 - 213","مديريت مالي\nروزانه - بیات",{"$f":"w!C73","v":"مديريت كسب و كار"},{"$f":"w!D73","v":"بازاريابي - استراتژي"},{"$f":"w!E73","v":"روزانه"},{"$f":"w!F73","v":"مديريت مالي"},{"$f":"w!I73","v":"بیات"},{"$f":"w!AB73","v":"یکشنبه"},{"$f":"w!AC73","v":""},{"$f":"w!AE73","v":"7-10"},{"$f":"w!AF73","v":""},{"$f":"w!AH73","v":"213"},{"$f":"w!AI73","v":"-"}]
["پنج شنبه - 7-10 - 208","مدیریت استراتژیک پیشرفته\nپردیس - حمیدی زاده",{"$f":"w!C74","v":"مديريت كسب و كار"},{"$f":"w!D74","v":"استراتژي"},{"$f":"w!E74","v":"پردیس"},{"$f":"w!F74","v":"مدیریت استراتژیک پیشرفته"},{"$f":"w!I74","v":"حمیدی زاده"},{"$f":"w!AB74","v":"پنج شنبه"},{"$f":"w!AC74","v":""},{"$f":"w!AE74","v":"7-10"},{"$f":"w!AF74","v":""},{"$f":"w!AH74","v":"208"},{"$f":"w!AI74","v":"-"}]
["یکشنبه - 15-17 - 213","پیاده سازی استراتژی\nروزانه - نورعلیزاده",{"$f":"w!C75","v":"مديريت كسب و كار"},{"$f":"w!D75","v":"استراتژي"},{"$f":"w!E75","v":"روزانه"},{"$f":"w!F75","v":"پیاده سازی استراتژی"},{"$f":"w!I75","v":"نورعلیزاده"},{"$f":"w!AB75","v":"یکشنبه"},{"$f":"w!AC75","v":"سه شنبه"},{"$f":"w!AE75","v":"15-17"},{"$f":"w!AF75","v":"15-17"},{"$f":"w!AH75","v":"213"},{"$f":"w!AI75","v":"213"}]
["چهارشنبه - 15-18 - 213","مدیریت اتحادهای اسراتژیک\nپردیس - علی احمدی",{"$f":"w!C76","v":"مديريت كسب و كار"},{"$f":"w!D76","v":"استراتژي"},{"$f":"w!E76","v":"پردیس"},{"$f":"w!F76","v":"مدیریت اتحادهای اسراتژیک"},{"$f":"w!I76","v":"علی احمدی"},{"$f":"w!AB76","v":"چهارشنبه"},{"$f":"w!AC76","v":""},{"$f":"w!AE76","v":"15-18"},{"$f":"w!AF76","v":""},{"$f":"w!AH76","v":"213"},{"$f":"w!AI76","v":"-"}]
["سه شنبه - 7-10 - 210","مباحث منتخب\nروزانه - رضایی",{"$f":"w!C77","v":"مديريت كسب و كار"},{"$f":"w!D77","v":"استراتژي"},{"$f":"w!E77","v":"روزانه"},{"$f":"w!F77","v":"مباحث منتخب"},{"$f":"w!I77","v":"رضایی"},{"$f":"w!AB77","v":"سه شنبه"},{"$f":"w!AC77","v":""},{"$f":"w!AE77","v":"7-10"},{"$f":"w!AF77","v":""},{"$f":"w!AH77","v":"210"},{"$f":"w!AI77","v":"-"}]
["چهارشنبه - 10-13 - ","مدیریت استراتژیک فناوری\nپردیس - ذاکری",{"$f":"w!C78","v":"مديريت كسب و كار"},{"$f":"w!D78","v":"استراتژي"},{"$f":"w!E78","v":"پردیس"},{"$f":"w!F78","v":"مدیریت استراتژیک فناوری"},{"$f":"w!I78","v":"ذاکری"},{"$f":"w!AB78","v":"چهارشنبه"},{"$f":"w!AC78","v":""},{"$f":"w!AE78","v":"10-13"},{"$f":"w!AF78","v":""},{"$f":"w!AH78","v":""},{"$f":"w!AI78","v":"-"}]
["یکشنبه - 10-12 - 213","مدیریت استراتژیک فناوری\nروزانه - ذاکری",{"$f":"w!C79","v":"مديريت كسب و كار"},{"$f":"w!D79","v":"استراتژي"},{"$f":"w!E79","v":"روزانه"},{"$f":"w!F79","v":"مدیریت استراتژیک فناوری"},{"$f":"w!I79","v":"ذاکری"},{"$f":"w!AB79","v":"یکشنبه"},{"$f":"w!AC79","v":"سه شنبه"},{"$f":"w!AE79","v":"10-12"},{"$f":"w!AF79","v":"10-12"},{"$f":"w!AH79","v":"213"},{"$f":"w!AI79","v":"210"}]
[" -  - ","پایان نامه\nپردیس - 0",{"$f":"w!C80","v":"مديريت كسب و كار"},{"$f":"w!D80","v":"بازاريابي - استراتژي"},{"$f":"w!E80","v":"پردیس"},{"$f":"w!F80","v":"پایان نامه"},{"$f":"w!I80","v":0},{"$f":"w!AB80","v":""},{"$f":"w!AC80","v":""},{"$f":"w!AE80","v":""},{"$f":"w!AF80","v":""},{"$f":"w!AH80","v":""},{"$f":"w!AI80","v":"-"}]
[" -  - ","پایان نامه\nروزانه - 0",{"$f":"w!C81","v":"مديريت كسب و كار"},{"$f":"w!D81","v":"بازاريابي - استراتژي"},{"$f":"w!E81","v":"روزانه"},{"$f":"w!F81","v":"پایان نامه"},{"$f":"w!I81","v":0},{"$f":"w!AB81","v":""},{"$f":"w!AC81","v":""},{"$f":"w!AE81","v":""},{"$f":"w!AF81","v":""},{"$f":"w!AH81","v":""},{"$f":"w!AI81","v":"-"}]
["سه شنبه - 10-12 - 208","اقتصاد سنجي ( جبرانی )\nروزانه - شوال پور",{"$f":"IF($I2<>\"\",w!C2,\"error\")","v":"علوم اقتصادی"},{"$f":"IF($I2<>\"\",w!D2,\"error\")","v":"برنامه ريزي سيستمهاي اقتصادي"},{"$f":"IF($I2<>\"\",w!E2,\"error\")","v":"روزانه"},{"$f":"IF($I2<>\"\",w!F2,\"error\")","v":"اقتصاد سنجي ( جبرانی )"},{"$f":"IF($I2<>\"\",w!I2,\"error\")","v":"شوال پور"},{"$f":"IF($I2<>\"\",w!AC2,\"error\")","v":"سه شنبه"},null,{"$f":"IF($I2<>\"\",w!AF2,\"error\")","v":"10-12"},null,{"$f":"IF($I2<>\"\",w!AI2,\"error\")","v":"208"}]
["سه شنبه - 15-17 - 208","اقتصاد كلان\nروزانه - رفیعی",{"$f":"IF($I3<>\"\",w!C3,\"error\")","v":"علوم اقتصادی"},{"$f":"IF($I3<>\"\",w!D3,\"error\")","v":"برنامه ريزي سيستمهاي اقتصادي"},{"$f":"IF($I3<>\"\",w!E3,\"error\")","v":"روزانه"},{"$f":"IF($I3<>\"\",w!F3,\"error\")","v":"اقتصاد كلان"},{"$f":"IF($I3<>\"\",w!I3,\"error\")","v":"رفیعی"},{"$f":"w!AC3","v":"سه شنبه"},null,{"$f":"w!AF3","v":"15-17"},null,{"$f":"w!AI3","v":"208"}]
["سه شنبه - 13-15 - 208","تحلیل تصمیم گیری\nروزانه - کرمانی",{"$f":"IF($I4<>\"\",w!C4,\"error\")","v":"علوم اقتصادی"},{"$f":"IF($I4<>\"\",w!D4,\"error\")","v":"برنامه ريزي سيستمهاي اقتصادي"},{"$f":"IF($I4<>\"\",w!E4,\"error\")","v":"روزانه"},{"$f":"IF($I4<>\"\",w!F4,\"error\")","v":"تحلیل تصمیم گیری"},{"$f":"IF($I4<>\"\",w!I4,\"error\")","v":"کرمانی"},{"$f":"w!AC4","v":"سه شنبه"},null,{"$f":"w!AF4","v":"13-15"},null,{"$f":"w!AI4","v":"208"}]
["سه شنبه - 8-10 - 207","سيستمهاي ديناميكي1\nروزانه - پارسانژاد",{"$f":"IF($I5<>\"\",w!C5,\"error\")","v":"علوم اقتصادی"},{"$f":"IF($I5<>\"\",w!D5,\"error\")","v":"برنامه ريزي سيستمهاي اقتصادي"},{"$f":"IF($I5<>\"\",w!E5,\"error\")","v":"روزانه"},{"$f":"IF($I5<>\"\",w!F5,\"error\")","v":"سيستمهاي ديناميكي1"},{"$f":"IF($I5<>\"\",w!I5,\"error\")","v":"پارسانژاد"},{"$f":"w!AC5","v":"سه شنبه"},null,{"$f":"w!AF5","v":"8-10"},null,{"$f":"w!AI5","v":"207"}]
[" -  - -","error\nerror - error",{"$f":"IF($I6<>\"\",w!C6,\"error\")","v":"error"},{"$f":"IF($I6<>\"\",w!D6,\"error\")","v":"error"},{"$f":"IF($I6<>\"\",w!E6,\"error\")","v":"error"},{"$f":"IF($I6<>\"\",w!F6,\"error\")","v":"error"},{"$f":"IF($I6<>\"\",w!I6,\"error\")","v":"error"},{"$f":"w!AC6","v":""},null,{"$f":"w!AF6","v":""},null,{"$f":"w!AI6","v":"-"}]
["دوشنبه - 8-10 - 208","اقتصاد خرد\nروزانه - رفیعی",{"$f":"IF($I7<>\"\",w!C7,\"error\")","v":"علوم اقتصادی"},{"$f":"IF($I7<>\"\",w!D7,\"error\")","v":"توسعه اقتصادي و برنامه ريزي"},{"$f":"IF($I7<>\"\",w!E7,\"error\")","v":"روزانه"},{"$f":"IF($I7<>\"\",w!F7,\"error\")","v":"اقتصاد خرد"},{"$f":"IF($I7<>\"\",w!I7,\"error\")","v":"رفیعی"},{"$f":"w!AC7","v":"دوشنبه"},null,{"$f":"w!AF7","v":"8-10"},null,{"$f":"w!AI7","v":"208"}]
["دوشنبه - 13-15 - 208","سیاستگذاری در بخش صنعت\nروزانه - محمدپور عمران",{"$f":"IF($I8<>\"\",w!C8,\"error\")","v":"علوم اقتصادی"},{"$f":"IF($I8<>\"\",w!D8,\"error\")","v":"توسعه اقتصادي و برنامه ريزي"},{"$f":"IF($I8<>\"\",w!E8,\"error\")","v":"روزانه"},{"$f":"IF($I8<>\"\",w!F8,\"error\")","v":"سیاستگذاری در بخش صنعت"},{"$f":"IF($I8<>\"\",w!I8,\"error\")","v":"محمدپور عمران"},{"$f":"w!AC8","v":"دوشنبه"},null,{"$f":"w!AF8","v":"13-15"},null,{"$f":"w!AI8","v":"208"}]
["دوشنبه - 15-17 - 208","اقتصاد كلان\nروزانه - ابوالحسنی",{"$f":"IF($I9<>\"\",w!C9,\"error\")","v":"علوم اقتصادی"},{"$f":"IF($I9<>\"\",w!D9,\"error\")","v":"توسعه اقتصادي و برنامه ريزي"},{"$f":"IF($I9<>\"\",w!E9,\"error\")","v":"روزانه"},{"$f":"IF($I9<>\"\",w!F9,\"error\")","v":"اقتصاد كلان"},{"$f":"IF($I9<>\"\",w!I9,\"error\")","v":"ابوالحسنی"},{"$f":"w!AC9","v":"دوشنبه"},null,{"$f":"w!AF9","v":"15-17"},null,{"$f":"w!AI9","v":"208"}]
[" -  - -","error\nerror - error",{"$f":"IF($I10<>\"\",w!C10,\"error\")","v":"error"},{"$f":"IF($I10<>\"\",w!D10,\"error\")","v":"error"},{"$f":"IF($I10<>\"\",w!E10,\"error\")","v":"error"},{"$f":"IF($I10<>\"\",w!F10,\"error\")","v":"error"},{"$f":"IF($I10<>\"\",w!I10,\"error\")","v":"error"},{"$f":"w!AC10","v":""},null,{"$f":"w!AF10","v":""},null,{"$f":"w!AI10","v":"-"}]
["سه شنبه - 8-10 - 208","اقتصاد كلان پيشرفته\nروزانه - میرزامحمدی",{"$f":"IF($I11<>\"\",w!C11,\"error\")","v":"مهندسي صنايع"},{"$f":"IF($I11<>\"\",w!D11,\"error\")","v":"سيستمهاي كلان"},{"$f":"IF($I11<>\"\",w!E11,\"error\")","v":"روزانه"},{"$f":"IF($I11<>\"\",w!F11,\"error\")","v":"اقتصاد كلان پيشرفته"},{"$f":"IF($I11<>\"\",w!I11,\"error\")","v":"میرزامحمدی"},{"$f":"w!AC11","v":"سه شنبه"},null,{"$f":"w!AF11","v":"8-10"},null,{"$f":"w!AI11","v":"208"}]
["سه شنبه - 10-12 - 207","داده كاوي: مدلها، الگوريتمها و كاربردها\nروزانه - رسولی",{"$f":"IF($I12<>\"\",w!C12,\"error\")","v":"مهندسي صنايع"},{"$f":"IF($I12<>\"\",w!D12,\"error\")","v":"سيستمهاي كلان"},{"$f":"IF($I12<>\"\",w!E12,\"error\")","v":"روزانه"},{"$f":"IF($I12<>\"\",w!F12,\"error\")","v":"داده كاوي: مدلها، الگوريتمها و كاربردها"},{"$f":"IF($I12<>\"\",w!I12,\"error\")","v":"رسولی"},{"$f":"w!AC12","v":"سه شنبه"},null,{"$f":"w!AF12","v":"10-12"},null,{"$f":"w!AI12","v":"207"}]
["سه شنبه - 13-15 - 207","مدلسازي پوياييهاي سيستم\nروزانه - پارسانژاد",{"$f":"IF($I13<>\"\",w!C13,\"error\")","v":"مهندسي صنايع"},{"$f":"IF($I13<>\"\",w!D13,\"error\")","v":"سيستمهاي كلان"},{"$f":"IF($I13<>\"\",w!E13,\"error\")","v":"روزانه"},{"$f":"IF($I13<>\"\",w!F13,\"error\")","v":"مدلسازي پوياييهاي سيستم"},{"$f":"IF($I13<>\"\",w!I13,\"error\")","v":"پارسانژاد"},{"$f":"w!AC13","v":"سه شنبه"},null,{"$f":"w!AF13","v":"13-15"},null,{"$f":"w!AI13","v":"207"}]
["سه شنبه - 15-17 - 207","مفاهیم و مدلهای تحلیل شبکه های اجتماعی\nروزانه - کرمانی",{"$f":"IF($I14<>\"\",w!C14,\"error\")","v":"مهندسي صنايع"},{"$f":"IF($I14<>\"\",w!D14,\"error\")","v":"سيستمهاي كلان"},{"$f":"IF($I14<>\"\",w!E14,\"error\")","v":"روزانه"},{"$f":"IF($I14<>\"\",w!F14,\"error\")","v":"مفاهیم و مدلهای تحلیل شبکه های اجتماعی"},{"$f":"IF($I14<>\"\",w!I14,\"error\")","v":"کرمانی"},{"$f":"w!AC14","v":"سه شنبه"},null,{"$f":"w!AF14","v":"15-17"},null,{"$f":"w!AI14","v":"207"}]
[" -  - -","error\nerror - error",{"$f":"IF($I15<>\"\",w!C15,\"error\")","v":"error"},{"$f":"IF($I15<>\"\",w!D15,\"error\")","v":"error"},{"$f":"IF($I15<>\"\",w!E15,\"error\")","v":"error"},{"$f":"IF($I15<>\"\",w!F15,\"error\")","v":"error"},{"$f":"IF($I15<>\"\",w!I15,\"error\")","v":"error"},{"$f":"w!AC15","v":""},null,{"$f":"w!AF15","v":""},null,{"$f":"w!AI15","v":"-"}]
[" -  - -","error\nerror - error",{"$f":"IF($I16<>\"\",w!C16,\"error\")","v":"error"},{"$f":"IF($I16<>\"\",w!D16,\"error\")","v":"error"},{"$f":"IF($I16<>\"\",w!E16,\"error\")","v":"error"},{"$f":"IF($I16<>\"\",w!F16,\"error\")","v":"error"},{"$f":"IF($I16<>\"\",w!I16,\"error\")","v":"error"},{"$f":"w!AC16","v":""},null,{"$f":"w!AF16","v":""},null,{"$f":"w!AI16","v":"-"}]
[" -  - -","error\nerror - error",{"$f":"IF($I17<>\"\",w!C17,\"error\")","v":"error"},{"$f":"IF($I17<>\"\",w!D17,\"error\")","v":"error"},{"$f":"IF($I17<>\"\",w!E17,\"error\")","v":"error"},{"$f":"IF($I17<>\"\",w!F17,\"error\")","v":"error"},{"$f":"IF($I17<>\"\",w!I17,\"error\")","v":"error"},{"$f":"w!AC17","v":""},null,{"$f":"w!AF17","v":""},null,{"$f":"w!AI17","v":"-"}]
[{"$f":"CONCATENATE(H98,\" - \",J98,\" - \",L98)","v":" -  - -"},{"$f":"CONCATENATE(F98,CHAR(10),E98,\" - \",G98)","v":"error\nerror - error"},{"$f":"IF($I18<>\"\",w!C18,\"error\")","v":"error"},{"$f":"IF($I18<>\"\",w!D18,\"error\")","v":"error"},{"$f":"IF($I18<>\"\",w!E18,\"error\")","v":"error"},{"$f":"IF($I18<>\"\",w!F18,\"error\")","v":"error"},{"$f":"IF($I18<>\"\",w!I18,\"error\")","v":"error"},{"$f":"w!AC18","v":""},null,{"$f":"w!AF18","v":""},null,{"$f":"w!AI18","v":"-"}]
[" -  - -","error\nerror - error",{"$f":"IF($I19<>\"\",w!C19,\"error\")","v":"error"},{"$f":"IF($I19<>\"\",w!D19,\"error\")","v":"error"},{"$f":"IF($I19<>\"\",w!E19,\"error\")","v":"error"},{"$f":"IF($I19<>\"\",w!F19,\"error\")","v":"error"},{"$f":"IF($I19<>\"\",w!I19,\"error\")","v":"error"},{"$f":"w!AC19","v":""},null,{"$f":"w!AF19","v":""},null,{"$f":"w!AI19","v":"-"}]
[" -  - -","error\nerror - error",{"$f":"IF($I20<>\"\",w!C20,\"error\")","v":"error"},{"$f":"IF($I20<>\"\",w!D20,\"error\")","v":"error"},{"$f":"IF($I20<>\"\",w!E20,\"error\")","v":"error"},{"$f":"IF($I20<>\"\",w!F20,\"error\")","v":"error"},{"$f":"IF($I20<>\"\",w!I20,\"error\")","v":"error"},{"$f":"w!AC20","v":""},null,{"$f":"w!AF20","v":""},null,{"$f":"w!AI20","v":"-"}]
[" -  - -","error\nerror - error",{"$f":"IF($I21<>\"\",w!C21,\"error\")","v":"error"},{"$f":"IF($I21<>\"\",w!D21,\"error\")","v":"error"},{"$f":"IF($I21<>\"\",w!E21,\"error\")","v":"error"},{"$f":"IF($I21<>\"\",w!F21,\"error\")","v":"error"},{"$f":"IF($I21<>\"\",w!I21,\"error\")","v":"error"},{"$f":"w!AC21","v":""},null,{"$f":"w!AF21","v":""},null,{"$f":"w!AI21","v":"-"}]
[" -  - -","error\nerror - error",{"$f":"IF($I22<>\"\",w!C22,\"error\")","v":"error"},{"$f":"IF($I22<>\"\",w!D22,\"error\")","v":"error"},{"$f":"IF($I22<>\"\",w!E22,\"error\")","v":"error"},{"$f":"IF($I22<>\"\",w!F22,\"error\")","v":"error"},{"$f":"IF($I22<>\"\",w!I22,\"error\")","v":"error"},{"$f":"w!AC22","v":""},null,{"$f":"w!AF22","v":""},null,{"$f":"w!AI22","v":"-"}]
[" -  - -","error\nerror - error",{"$f":"IF($I23<>\"\",w!C23,\"error\")","v":"error"},{"$f":"IF($I23<>\"\",w!D23,\"error\")","v":"error"},{"$f":"IF($I23<>\"\",w!E23,\"error\")","v":"error"},{"$f":"IF($I23<>\"\",w!F23,\"error\")","v":"error"},{"$f":"IF($I23<>\"\",w!I23,\"error\")","v":"error"},{"$f":"w!AC23","v":""},null,{"$f":"w!AF23","v":""},null,{"$f":"w!AI23","v":"-"}]
[" -  - -","error\nerror - error",{"$f":"IF($I24<>\"\",w!C24,\"error\")","v":"error"},{"$f":"IF($I24<>\"\",w!D24,\"error\")","v":"error"},{"$f":"IF($I24<>\"\",w!E24,\"error\")","v":"error"},{"$f":"IF($I24<>\"\",w!F24,\"error\")","v":"error"},{"$f":"IF($I24<>\"\",w!I24,\"error\")","v":"error"},{"$f":"w!AC24","v":""},null,{"$f":"w!AF24","v":""},null,{"$f":"w!AI24","v":"-"}]
[" -  - -","error\nerror - error",{"$f":"IF($I25<>\"\",w!C25,\"error\")","v":"error"},{"$f":"IF($I25<>\"\",w!D25,\"error\")","v":"error"},{"$f":"IF($I25<>\"\",w!E25,\"error\")","v":"error"},{"$f":"IF($I25<>\"\",w!F25,\"error\")","v":"error"},{"$f":"IF($I25<>\"\",w!I25,\"error\")","v":"error"},{"$f":"w!AC25","v":""},null,{"$f":"w!AF25","v":""},null,{"$f":"w!AI25","v":"-"}]
[" -  - -","error\nerror - error",{"$f":"IF($I26<>\"\",w!C26,\"error\")","v":"error"},{"$f":"IF($I26<>\"\",w!D26,\"error\")","v":"error"},{"$f":"IF($I26<>\"\",w!E26,\"error\")","v":"error"},{"$f":"IF($I26<>\"\",w!F26,\"error\")","v":"error"},{"$f":"IF($I26<>\"\",w!I26,\"error\")","v":"error"},{"$f":"w!AC26","v":""},null,{"$f":"w!AF26","v":""},null,{"$f":"w!AI26","v":"-"}]
[" -  - -","error\nerror - error",{"$f":"IF($I27<>\"\",w!C27,\"error\")","v":"error"},{"$f":"IF($I27<>\"\",w!D27,\"error\")","v":"error"},{"$f":"IF($I27<>\"\",w!E27,\"error\")","v":"error"},{"$f":"IF($I27<>\"\",w!F27,\"error\")","v":"error"},{"$f":"IF($I27<>\"\",w!I27,\"error\")","v":"error"},{"$f":"w!AC27","v":""},null,{"$f":"w!AF27","v":""},null,{"$f":"w!AI27","v":"-"}]
[" -  - -","error\nerror - error",{"$f":"IF($I28<>\"\",w!C28,\"error\")","v":"error"},{"$f":"IF($I28<>\"\",w!D28,\"error\")","v":"error"},{"$f":"IF($I28<>\"\",w!E28,\"error\")","v":"error"},{"$f":"IF($I28<>\"\",w!F28,\"error\")","v":"error"},{"$f":"IF($I28<>\"\",w!I28,\"error\")","v":"error"},{"$f":"w!AC28","v":""},null,{"$f":"w!AF28","v":""},null,{"$f":"w!AI28","v":"-"}]
[" -  - -","error\nerror - error",{"$f":"IF($I29<>\"\",w!C29,\"error\")","v":"error"},{"$f":"IF($I29<>\"\",w!D29,\"error\")","v":"error"},{"$f":"IF($I29<>\"\",w!E29,\"error\")","v":"error"},{"$f":"IF($I29<>\"\",w!F29,\"error\")","v":"error"},{"$f":"IF($I29<>\"\",w!I29,\"error\")","v":"error"},{"$f":"w!AC29","v":""},null,{"$f":"w!AF29","v":""},null,{"$f":"w!AI29","v":"-"}]
[" -  - -","error\nerror - error",{"$f":"IF($I30<>\"\",w!C30,\"error\")","v":"error"},{"$f":"IF($I30<>\"\",w!D30,\"error\")","v":"error"},{"$f":"IF($I30<>\"\",w!E30,\"error\")","v":"error"},{"$f":"IF($I30<>\"\",w!F30,\"error\")","v":"error"},{"$f":"IF($I30<>\"\",w!I30,\"error\")","v":"error"},{"$f":"w!AC30","v":""},null,{"$f":"w!AF30","v":""},null,{"$f":"w!AI30","v":"-"}]
[" -  - -","error\nerror - error",{"$f":"IF($I31<>\"\",w!C31,\"error\")","v":"error"},{"$f":"IF($I31<>\"\",w!D31,\"error\")","v":"error"},{"$f":"IF($I31<>\"\",w!E31,\"error\")","v":"error"},{"$f":"IF($I31<>\"\",w!F31,\"error\")","v":"error"},{"$f":"IF($I31<>\"\",w!I31,\"error\")","v":"error"},{"$f":"w!AC31","v":""},null,{"$f":"w!AF31","v":""},null,{"$f":"w!AI31","v":"-"}]
[" -  - -","error\nerror - error",{"$f":"IF($I32<>\"\",w!C32,\"error\")","v":"error"},{"$f":"IF($I32<>\"\",w!D32,\"error\")","v":"error"},{"$f":"IF($I32<>\"\",w!E32,\"error\")","v":"error"},{"$f":"IF($I32<>\"\",w!F32,\"error\")","v":"error"},{"$f":"IF($I32<>\"\",w!I32,\"error\")","v":"error"},{"$f":"w!AC32","v":""},null,{"$f":"w!AF32","v":""},null,{"$f":"w!AI32","v":"-"}]
[" -  - -","error\nerror - error",{"$f":"IF($I33<>\"\",w!C33,\"error\")","v":"error"},{"$f":"IF($I33<>\"\",w!D33,\"error\")","v":"error"},{"$f":"IF($I33<>\"\",w!E33,\"error\")","v":"error"},{"$f":"IF($I33<>\"\",w!F33,\"error\")","v":"error"},{"$f":"IF($I33<>\"\",w!I33,\"error\")","v":"error"},{"$f":"w!AC33","v":""},null,{"$f":"w!AF33","v":""},null,{"$f":"w!AI33","v":"-"}]
[" -  - -","error\nerror - error",{"$f":"IF($I34<>\"\",w!C34,\"error\")","v":"error"},{"$f":"IF($I34<>\"\",w!D34,\"error\")","v":"error"},{"$f":"IF($I34<>\"\",w!E34,\"error\")","v":"error"},{"$f":"IF($I34<>\"\",w!F34,\"error\")","v":"error"},{"$f":"IF($I34<>\"\",w!I34,\"error\")","v":"error"},{"$f":"w!AC34","v":""},null,{"$f":"w!AF34","v":""},null,{"$f":"w!AI34","v":"-"}]
[" -  - -","error\nerror - error",{"$f":"IF($I35<>\"\",w!C35,\"error\")","v":"error"},{"$f":"IF($I35<>\"\",w!D35,\"error\")","v":"error"},{"$f":"IF($I35<>\"\",w!E35,\"error\")","v":"error"},{"$f":"IF($I35<>\"\",w!F35,\"error\")","v":"error"},{"$f":"IF($I35<>\"\",w!I35,\"error\")","v":"error"},{"$f":"w!AC35","v":""},null,{"$f":"w!AF35","v":""},null,{"$f":"w!AI35","v":"-"}]
[" -  - -","error\nerror - error",{"$f":"IF($I36<>\"\",w!C36,\"error\")","v":"error"},{"$f":"IF($I36<>\"\",w!D36,\"error\")","v":"error"},{"$f":"IF($I36<>\"\",w!E36,\"error\")","v":"error"},{"$f":"IF($I36<>\"\",w!F36,\"error\")","v":"error"},{"$f":"IF($I36<>\"\",w!I36,\"error\")","v":"error"},{"$f":"w!AC36","v":""},null,{"$f":"w!AF36","v":""},null,{"$f":"w!AI36","v":"-"}]
[" -  - -","error\nerror - error",{"$f":"IF($I37<>\"\",w!C37,\"error\")","v":"error"},{"$f":"IF($I37<>\"\",w!D37,\"error\")","v":"error"},{"$f":"IF($I37<>\"\",w!E37,\"error\")","v":"error"},{"$f":"IF($I37<>\"\",w!F37,\"error\")","v":"error"},{"$f":"IF($I37<>\"\",w!I37,\"error\")","v":"error"},{"$f":"w!AC37","v":""},null,{"$f":"w!AF37","v":""},null,{"$f":"w!AI37","v":"-"}]
[" -  - -","error\nerror - error",{"$f":"IF($I38<>\"\",w!C38,\"error\")","v":"error"},{"$f":"IF($I38<>\"\",w!D38,\"error\")","v":"error"},{"$f":"IF($I38<>\"\",w!E38,\"error\")","v":"error"},{"$f":"IF($I38<>\"\",w!F38,\"error\")","v":"error"},{"$f":"IF($I38<>\"\",w!I38,\"error\")","v":"error"},{"$f":"w!AC38","v":""},null,{"$f":"w!AF38","v":""},null,{"$f":"w!AI38","v":"-"}]
[" -  - -","error\nerror - error",{"$f":"IF($I39<>\"\",w!C39,\"error\")","v":"error"},{"$f":"IF($I39<>\"\",w!D39,\"error\")","v":"error"},{"$f":"IF($I39<>\"\",w!E39,\"error\")","v":"error"},{"$f":"IF($I39<>\"\",w!F39,\"error\")","v":"error"},{"$f":"IF($I39<>\"\",w!I39,\"error\")","v":"error"},{"$f":"w!AC39","v":""},null,{"$f":"w!AF39","v":""},null,{"$f":"w!AI39","v":"-"}]
[" -  - -","error\nerror - error",{"$f":"IF($I40<>\"\",w!C40,\"error\")","v":"error"},{"$f":"IF($I40<>\"\",w!D40,\"error\")","v":"error"},{"$f":"IF($I40<>\"\",w!E40,\"error\")","v":"error"},{"$f":"IF($I40<>\"\",w!F40,\"error\")","v":"error"},{"$f":"IF($I40<>\"\",w!I40,\"error\")","v":"error"},{"$f":"w!AC40","v":""},null,{"$f":"w!AF40","v":""},null,{"$f":"w!AI40","v":"-"}]
[" -  - -","error\nerror - error",{"$f":"IF($I41<>\"\",w!C41,\"error\")","v":"error"},{"$f":"IF($I41<>\"\",w!D41,\"error\")","v":"error"},{"$f":"IF($I41<>\"\",w!E41,\"error\")","v":"error"},{"$f":"IF($I41<>\"\",w!F41,\"error\")","v":"error"},{"$f":"IF($I41<>\"\",w!I41,\"error\")","v":"error"},{"$f":"w!AC41","v":""},null,{"$f":"w!AF41","v":""},null,{"$f":"w!AI41","v":"-"}]
[" -  - -","error\nerror - error",{"$f":"IF($I42<>\"\",w!C42,\"error\")","v":"error"},{"$f":"IF($I42<>\"\",w!D42,\"error\")","v":"error"},{"$f":"IF($I42<>\"\",w!E42,\"error\")","v":"error"},{"$f":"IF($I42<>\"\",w!F42,\"error\")","v":"error"},{"$f":"IF($I42<>\"\",w!I42,\"error\")","v":"error"},{"$f":"w!AC42","v":""},null,{"$f":"w!AF42","v":""},null,{"$f":"w!AI42","v":"-"}]
[" -  - -","error\nerror - error",{"$f":"IF($I43<>\"\",w!C43,\"error\")","v":"error"},{"$f":"IF($I43<>\"\",w!D43,\"error\")","v":"error"},{"$f":"IF($I43<>\"\",w!E43,\"error\")","v":"error"},{"$f":"IF($I43<>\"\",w!F43,\"error\")","v":"error"},{"$f":"IF($I43<>\"\",w!I43,\"error\")","v":"error"},{"$f":"w!AC43","v":""},null,{"$f":"w!AF43","v":""},null,{"$f":"w!AI43","v":"-"}]
[" -  - -","error\nerror - error",{"$f":"IF($I44<>\"\",w!C44,\"error\")","v":"error"},{"$f":"IF($I44<>\"\",w!D44,\"error\")","v":"error"},{"$f":"IF($I44<>\"\",w!E44,\"error\")","v":"error"},{"$f":"IF($I44<>\"\",w!F44,\"error\")","v":"error"},{"$f":"IF($I44<>\"\",w!I44,\"error\")","v":"error"},{"$f":"w!AC44","v":""},null,{"$f":"w!AF44","v":""},null,{"$f":"w!AI44","v":"-"}]
[" -  - -","error\nerror - error",{"$f":"IF($I45<>\"\",w!C45,\"error\")","v":"error"},{"$f":"IF($I45<>\"\",w!D45,\"error\")","v":"error"},{"$f":"IF($I45<>\"\",w!E45,\"error\")","v":"error"},{"$f":"IF($I45<>\"\",w!F45,\"error\")","v":"error"},{"$f":"IF($I45<>\"\",w!I45,\"error\")","v":"error"},{"$f":"w!AC45","v":""},null,{"$f":"w!AF45","v":""},null,{"$f":"w!AI45","v":"-"}]
[" -  - -","error\nerror - error",{"$f":"IF($I46<>\"\",w!C46,\"error\")","v":"error"},{"$f":"IF($I46<>\"\",w!D46,\"error\")","v":"error"},{"$f":"IF($I46<>\"\",w!E46,\"error\")","v":"error"},{"$f":"IF($I46<>\"\",w!F46,\"error\")","v":"error"},{"$f":"IF($I46<>\"\",w!I46,\"error\")","v":"error"},{"$f":"w!AC46","v":""},null,{"$f":"w!AF46","v":""},null,{"$f":"w!AI46","v":"-"}]
[" -  - -","error\nerror - error",{"$f":"IF($I47<>\"\",w!C47,\"error\")","v":"error"},{"$f":"IF($I47<>\"\",w!D47,\"error\")","v":"error"},{"$f":"IF($I47<>\"\",w!E47,\"error\")","v":"error"},{"$f":"IF($I47<>\"\",w!F47,\"error\")","v":"error"},{"$f":"IF($I47<>\"\",w!I47,\"error\")","v":"error"},{"$f":"w!AC47","v":""},null,{"$f":"w!AF47","v":""},null,{"$f":"w!AI47","v":"-"}]
[" -  - -","error\nerror - error",{"$f":"IF($I48<>\"\",w!C48,\"error\")","v":"error"},{"$f":"IF($I48<>\"\",w!D48,\"error\")","v":"error"},{"$f":"IF($I48<>\"\",w!E48,\"error\")","v":"error"},{"$f":"IF($I48<>\"\",w!F48,\"error\")","v":"error"},{"$f":"IF($I48<>\"\",w!I48,\"error\")","v":"error"},{"$f":"w!AC48","v":""},null,{"$f":"w!AF48","v":""},null,{"$f":"w!AI48","v":"-"}]
[" -  - -","error\nerror - error",{"$f":"IF($I49<>\"\",w!C49,\"error\")","v":"error"},{"$f":"IF($I49<>\"\",w!D49,\"error\")","v":"error"},{"$f":"IF($I49<>\"\",w!E49,\"error\")","v":"error"},{"$f":"IF($I49<>\"\",w!F49,\"error\")","v":"error"},{"$f":"IF($I49<>\"\",w!I49,\"error\")","v":"error"},{"$f":"w!AC49","v":""},null,{"$f":"w!AF49","v":""},null,{"$f":"w!AI49","v":"-"}]
[{"$f":"CONCATENATE(H130,\" - \",J130,\" - \",L130)","v":" -  - -"},{"$f":"CONCATENATE(F130,CHAR(10),E130,\" - \",G130)","v":"error\nerror - error"},{"$f":"IF($I50<>\"\",w!C50,\"error\")","v":"error"},{"$f":"IF($I50<>\"\",w!D50,\"error\")","v":"error"},{"$f":"IF($I50<>\"\",w!E50,\"error\")","v":"error"},{"$f":"IF($I50<>\"\",w!F50,\"error\")","v":"error"},{"$f":"IF($I50<>\"\",w!I50,\"error\")","v":"error"},{"$f":"w!AC50","v":""},null,{"$f":"w!AF50","v":""},null,{"$f":"w!AI50","v":"-"}]
[" -  - -","error\nerror - error",{"$f":"IF($I51<>\"\",w!C51,\"error\")","v":"error"},{"$f":"IF($I51<>\"\",w!D51,\"error\")","v":"error"},{"$f":"IF($I51<>\"\",w!E51,\"error\")","v":"error"},{"$f":"IF($I51<>\"\",w!F51,\"error\")","v":"error"},{"$f":"IF($I51<>\"\",w!I51,\"error\")","v":"error"},{"$f":"w!AC51","v":""},null,{"$f":"w!AF51","v":""},null,{"$f":"w!AI51","v":"-"}]
[" -  - -","error\nerror - error",{"$f":"IF($I52<>\"\",w!C52,\"error\")","v":"error"},{"$f":"IF($I52<>\"\",w!D52,\"error\")","v":"error"},{"$f":"IF($I52<>\"\",w!E52,\"error\")","v":"error"},{"$f":"IF($I52<>\"\",w!F52,\"error\")","v":"error"},{"$f":"IF($I52<>\"\",w!I52,\"error\")","v":"error"},{"$f":"w!AC52","v":""},null,{"$f":"w!AF52","v":""},null,{"$f":"w!AI52","v":"-"}]
[" -  - -","error\nerror - error",{"$f":"IF($I53<>\"\",w!C53,\"error\")","v":"error"},{"$f":"IF($I53<>\"\",w!D53,\"error\")","v":"error"},{"$f":"IF($I53<>\"\",w!E53,\"error\")","v":"error"},{"$f":"IF($I53<>\"\",w!F53,\"error\")","v":"error"},{"$f":"IF($I53<>\"\",w!I53,\"error\")","v":"error"},{"$f":"w!AC53","v":""},null,{"$f":"w!AF53","v":""},null,{"$f":"w!AI53","v":"-"}]
[" -  - -","error\nerror - error",{"$f":"IF($I54<>\"\",w!C54,\"error\")","v":"error"},{"$f":"IF($I54<>\"\",w!D54,\"error\")","v":"error"},{"$f":"IF($I54<>\"\",w!E54,\"error\")","v":"error"},{"$f":"IF($I54<>\"\",w!F54,\"error\")","v":"error"},{"$f":"IF($I54<>\"\",w!I54,\"error\")","v":"error"},{"$f":"w!AC54","v":""},null,{"$f":"w!AF54","v":""},null,{"$f":"w!AI54","v":"-"}]
[" -  - -","error\nerror - error",{"$f":"IF($I55<>\"\",w!C55,\"error\")","v":"error"},{"$f":"IF($I55<>\"\",w!D55,\"error\")","v":"error"},{"$f":"IF($I55<>\"\",w!E55,\"error\")","v":"error"},{"$f":"IF($I55<>\"\",w!F55,\"error\")","v":"error"},{"$f":"IF($I55<>\"\",w!I55,\"error\")","v":"error"},{"$f":"w!AC55","v":""},null,{"$f":"w!AF55","v":""},null,{"$f":"w!AI55","v":"-"}]
[" -  - -","error\nerror - error",{"$f":"IF($I56<>\"\",w!C56,\"error\")","v":"error"},{"$f":"IF($I56<>\"\",w!D56,\"error\")","v":"error"},{"$f":"IF($I56<>\"\",w!E56,\"error\")","v":"error"},{"$f":"IF($I56<>\"\",w!F56,\"error\")","v":"error"},{"$f":"IF($I56<>\"\",w!I56,\"error\")","v":"error"},{"$f":"w!AC56","v":""},null,{"$f":"w!AF56","v":""},null,{"$f":"w!AI56","v":"-"}]
[" -  - -","error\nerror - error",{"$f":"IF($I57<>\"\",w!C57,\"error\")","v":"error"},{"$f":"IF($I57<>\"\",w!D57,\"error\")","v":"error"},{"$f":"IF($I57<>\"\",w!E57,\"error\")","v":"error"},{"$f":"IF($I57<>\"\",w!F57,\"error\")","v":"error"},{"$f":"IF($I57<>\"\",w!I57,\"error\")","v":"error"},{"$f":"w!AC57","v":""},null,{"$f":"w!AF57","v":""},null,{"$f":"w!AI57","v":"-"}]
[" -  - -","error\nerror - error",{"$f":"IF($I58<>\"\",w!C58,\"error\")","v":"error"},{"$f":"IF($I58<>\"\",w!D58,\"error\")","v":"error"},{"$f":"IF($I58<>\"\",w!E58,\"error\")","v":"error"},{"$f":"IF($I58<>\"\",w!F58,\"error\")","v":"error"},{"$f":"IF($I58<>\"\",w!I58,\"error\")","v":"error"},{"$f":"w!AC58","v":""},null,{"$f":"w!AF58","v":""},null,{"$f":"w!AI58","v":"-"}]
[" -  - -","error\nerror - error",{"$f":"IF($I59<>\"\",w!C59,\"error\")","v":"error"},{"$f":"IF($I59<>\"\",w!D59,\"error\")","v":"error"},{"$f":"IF($I59<>\"\",w!E59,\"error\")","v":"error"},{"$f":"IF($I59<>\"\",w!F59,\"error\")","v":"error"},{"$f":"IF($I59<>\"\",w!I59,\"error\")","v":"error"},{"$f":"w!AC59","v":""},null,{"$f":"w!AF59","v":""},null,{"$f":"w!AI59","v":"-"}]
["سه شنبه - 13-15 - 209","اخلاق و احكام كسب و كار\nروزانه - معینی",{"$f":"IF($I60<>\"\",w!C60,\"error\")","v":"مديريت كسب و كار"},{"$f":"IF($I60<>\"\",w!D60,\"error\")","v":"بازاريابي - استراتژي"},{"$f":"IF($I60<>\"\",w!E60,\"error\")","v":"روزانه"},{"$f":"IF($I60<>\"\",w!F60,\"error\")","v":"اخلاق و احكام كسب و كار"},{"$f":"IF($I60<>\"\",w!I60,\"error\")","v":"معینی"},{"$f":"w!AC60","v":"سه شنبه"},null,{"$f":"w!AF60","v":"13-15"},null,{"$f":"w!AI60","v":"209"}]
[" -  - -","error\nerror - error",{"$f":"IF($I61<>\"\",w!C61,\"error\")","v":"error"},{"$f":"IF($I61<>\"\",w!D61,\"error\")","v":"error"},{"$f":"IF($I61<>\"\",w!E61,\"error\")","v":"error"},{"$f":"IF($I61<>\"\",w!F61,\"error\")","v":"error"},{"$f":"IF($I61<>\"\",w!I61,\"error\")","v":"error"},{"$f":"w!AC61","v":""},null,{"$f":"w!AF61","v":""},null,{"$f":"w!AI61","v":"-"}]
["سه شنبه - 10-12 - 209","اصول اقتصاد\nروزانه - حکیمی پور",{"$f":"IF($I62<>\"\",w!C62,\"error\")","v":"مديريت كسب و كار"},{"$f":"IF($I62<>\"\",w!D62,\"error\")","v":"بازاريابي - استراتژي"},{"$f":"IF($I62<>\"\",w!E62,\"error\")","v":"روزانه"},{"$f":"IF($I62<>\"\",w!F62,\"error\")","v":"اصول اقتصاد"},{"$f":"IF($I62<>\"\",w!I62,\"error\")","v":"حکیمی پور"},{"$f":"w!AC62","v":"سه شنبه"},null,{"$f":"w!AF62","v":"10-12"},null,{"$f":"w!AI62","v":"209"}]
[" -  - -","error\nerror - error",{"$f":"IF($I63<>\"\",w!C63,\"error\")","v":"error"},{"$f":"IF($I63<>\"\",w!D63,\"error\")","v":"error"},{"$f":"IF($I63<>\"\",w!E63,\"error\")","v":"error"},{"$f":"IF($I63<>\"\",w!F63,\"error\")","v":"error"},{"$f":"IF($I63<>\"\",w!I63,\"error\")","v":"error"},{"$f":"w!AC63","v":""},null,{"$f":"w!AF63","v":""},null,{"$f":"w!AI63","v":"-"}]
["سه شنبه - 15-17 - 209","تصميم گيري براي مديران\nروزانه - سبحانی فرد",{"$f":"IF($I64<>\"\",w!C64,\"error\")","v":"مديريت كسب و كار"},{"$f":"IF($I64<>\"\",w!D64,\"error\")","v":"بازاريابي - استراتژي"},{"$f":"IF($I64<>\"\",w!E64,\"error\")","v":"روزانه"},{"$f":"IF($I64<>\"\",w!F64,\"error\")","v":"تصميم گيري براي مديران"},{"$f":"IF($I64<>\"\",w!I64,\"error\")","v":"سبحانی فرد"},{"$f":"w!AC64","v":"سه شنبه"},null,{"$f":"w!AF64","v":"15-17"},null,{"$f":"w!AI64","v":"209"}]
[" -  - -","error\nerror - error",{"$f":"IF($I65<>\"\",w!C65,\"error\")","v":"error"},{"$f":"IF($I65<>\"\",w!D65,\"error\")","v":"error"},{"$f":"IF($I65<>\"\",w!E65,\"error\")","v":"error"},{"$f":"IF($I65<>\"\",w!F65,\"error\")","v":"error"},{"$f":"IF($I65<>\"\",w!I65,\"error\")","v":"error"},{"$f":"w!AC65","v":""},null,{"$f":"w!AF65","v":""},null,{"$f":"w!AI65","v":"-"}]
[" -  - -","error\nerror - error",{"$f":"IF($I66<>\"\",w!C66,\"error\")","v":"error"},{"$f":"IF($I66<>\"\",w!D66,\"error\")","v":"error"},{"$f":"IF($I66<>\"\",w!E66,\"error\")","v":"error"},{"$f":"IF($I66<>\"\",w!F66,\"error\")","v":"error"},{"$f":"IF($I66<>\"\",w!I66,\"error\")","v":"error"},{"$f":"w!AC66","v":""},null,{"$f":"w!AF66","v":""},null,{"$f":"w!AI66","v":"-"}]
["سه شنبه - 8-10 - 209","مديريت رفتار سازماني\nروزانه - بنیادی",{"$f":"IF($I67<>\"\",w!C67,\"error\")","v":"مديريت كسب و كار"},{"$f":"IF($I67<>\"\",w!D67,\"error\")","v":"بازاريابي - استراتژي"},{"$f":"IF($I67<>\"\",w!E67,\"error\")","v":"روزانه"},{"$f":"IF($I67<>\"\",w!F67,\"error\")","v":"مديريت رفتار سازماني"},{"$f":"IF($I67<>\"\",w!I67,\"error\")","v":"بنیادی"},{"$f":"w!AC67","v":"سه شنبه"},null,{"$f":"w!AF67","v":"8-10"},null,{"$f":"w!AI67","v":"209"}]
[" -  - -","error\nerror - error",{"$f":"IF($I68<>\"\",w!C68,\"error\")","v":"error"},{"$f":"IF($I68<>\"\",w!D68,\"error\")","v":"error"},{"$f":"IF($I68<>\"\",w!E68,\"error\")","v":"error"},{"$f":"IF($I68<>\"\",w!F68,\"error\")","v":"error"},{"$f":"IF($I68<>\"\",w!I68,\"error\")","v":"error"},{"$f":"w!AC68","v":""},null,{"$f":"w!AF68","v":""},null,{"$f":"w!AI68","v":"-"}]
["سه شنبه - 13-15 - 210","رفتار مصرف کننده\nروزانه - سبحانی فرد",{"$f":"IF($I69<>\"\",w!C69,\"error\")","v":"مديريت كسب و كار"},{"$f":"IF($I69<>\"\",w!D69,\"error\")","v":"بازاريابي"},{"$f":"IF($I69<>\"\",w!E69,\"error\")","v":"روزانه"},{"$f":"IF($I69<>\"\",w!F69,\"error\")","v":"رفتار مصرف کننده"},{"$f":"IF($I69<>\"\",w!I69,\"error\")","v":"سبحانی فرد"},{"$f":"w!AC69","v":"سه شنبه"},null,{"$f":"w!AF69","v":"13-15"},null,{"$f":"w!AI69","v":"210"}]
[" -  - -","error\nerror - error",{"$f":"IF($I70<>\"\",w!C70,\"error\")","v":"error"},{"$f":"IF($I70<>\"\",w!D70,\"error\")","v":"error"},{"$f":"IF($I70<>\"\",w!E70,\"error\")","v":"error"},{"$f":"IF($I70<>\"\",w!F70,\"error\")","v":"error"},{"$f":"IF($I70<>\"\",w!I70,\"error\")","v":"error"},{"$f":"w!AC70","v":""},null,{"$f":"w!AF70","v":""},null,{"$f":"w!AI70","v":"-"}]
[" -  - -","error\nerror - error",{"$f":"IF($I71<>\"\",w!C71,\"error\")","v":"error"},{"$f":"IF($I71<>\"\",w!D71,\"error\")","v":"error"},{"$f":"IF($I71<>\"\",w!E71,\"error\")","v":"error"},{"$f":"IF($I71<>\"\",w!F71,\"error\")","v":"error"},{"$f":"IF($I71<>\"\",w!I71,\"error\")","v":"error"},{"$f":"w!AC71","v":""},null,{"$f":"w!AF71","v":""},null,{"$f":"w!AI71","v":"-"}]
[" -  - -","error\nerror - error",{"$f":"IF($I72<>\"\",w!C72,\"error\")","v":"error"},{"$f":"IF($I72<>\"\",w!D72,\"error\")","v":"error"},{"$f":"IF($I72<>\"\",w!E72,\"error\")","v":"error"},{"$f":"IF($I72<>\"\",w!F72,\"error\")","v":"error"},{"$f":"IF($I72<>\"\",w!I72,\"error\")","v":"error"},{"$f":"w!AC72","v":""},null,{"$f":"w!AF72","v":""},null,{"$f":"w!AI72","v":"-"}]
[" -  - -","error\nerror - error",{"$f":"IF($I73<>\"\",w!C73,\"error\")","v":"error"},{"$f":"IF($I73<>\"\",w!D73,\"error\")","v":"error"},{"$f":"IF($I73<>\"\",w!E73,\"error\")","v":"error"},{"$f":"IF($I73<>\"\",w!F73,\"error\")","v":"error"},{"$f":"IF($I73<>\"\",w!I73,\"error\")","v":"error"},{"$f":"w!AC73","v":""},null,{"$f":"w!AF73","v":""},null,{"$f":"w!AI73","v":"-"}]
[" -  - -","error\nerror - error",{"$f":"IF($I74<>\"\",w!C74,\"error\")","v":"error"},{"$f":"IF($I74<>\"\",w!D74,\"error\")","v":"error"},{"$f":"IF($I74<>\"\",w!E74,\"error\")","v":"error"},{"$f":"IF($I74<>\"\",w!F74,\"error\")","v":"error"},{"$f":"IF($I74<>\"\",w!I74,\"error\")","v":"error"},{"$f":"w!AC74","v":""},null,{"$f":"w!AF74","v":""},null,{"$f":"w!AI74","v":"-"}]
["سه شنبه - 15-17 - 213","پیاده سازی استراتژی\nروزانه - نورعلیزاده",{"$f":"IF($I75<>\"\",w!C75,\"error\")","v":"مديريت كسب و كار"},{"$f":"IF($I75<>\"\",w!D75,\"error\")","v":"استراتژي"},{"$f":"IF($I75<>\"\",w!E75,\"error\")","v":"روزانه"},{"$f":"IF($I75<>\"\",w!F75,\"error\")","v":"پیاده سازی استراتژی"},{"$f":"IF($I75<>\"\",w!I75,\"error\")","v":"نورعلیزاده"},{"$f":"w!AC75","v":"سه شنبه"},null,{"$f":"w!AF75","v":"15-17"},null,{"$f":"w!AI75","v":"213"}]
[" -  - -","error\nerror - error",{"$f":"IF($I76<>\"\",w!C76,\"error\")","v":"error"},{"$f":"IF($I76<>\"\",w!D76,\"error\")","v":"error"},{"$f":"IF($I76<>\"\",w!E76,\"error\")","v":"error"},{"$f":"IF($I76<>\"\",w!F76,\"error\")","v":"error"},{"$f":"IF($I76<>\"\",w!I76,\"error\")","v":"error"},{"$f":"w!AC76","v":""},null,{"$f":"w!AF76","v":""},null,{"$f":"w!AI76","v":"-"}]
[" -  - -","error\nerror - error",{"$f":"IF($I77<>\"\",w!C77,\"error\")","v":"error"},{"$f":"IF($I77<>\"\",w!D77,\"error\")","v":"error"},{"$f":"IF($I77<>\"\",w!E77,\"error\")","v":"error"},{"$f":"IF($I77<>\"\",w!F77,\"error\")","v":"error"},{"$f":"IF($I77<>\"\",w!I77,\"error\")","v":"error"},{"$f":"w!AC77","v":""},null,{"$f":"w!AF77","v":""},null,{"$f":"w!AI77","v":"-"}]
[" -  - -","error\nerror - error",{"$f":"IF($I78<>\"\",w!C78,\"error\")","v":"error"},{"$f":"IF($I78<>\"\",w!D78,\"error\")","v":"error"},{"$f":"IF($I78<>\"\",w!E78,\"error\")","v":"error"},{"$f":"IF($I78<>\"\",w!F78,\"error\")","v":"error"},{"$f":"IF($I78<>\"\",w!I78,\"error\")","v":"error"},{"$f":"w!AC78","v":""},null,{"$f":"w!AF78","v":""},null,{"$f":"w!AI78","v":"-"}]
["سه شنبه - 10-12 - 210","مدیریت استراتژیک فناوری\nروزانه - ذاکری",{"$f":"IF($I79<>\"\",w!C79,\"error\")","v":"مديريت كسب و كار"},{"$f":"IF($I79<>\"\",w!D79,\"error\")","v":"استراتژي"},{"$f":"IF($I79<>\"\",w!E79,\"error\")","v":"روزانه"},{"$f":"IF($I79<>\"\",w!F79,\"error\")","v":"مدیریت استراتژیک فناوری"},{"$f":"IF($I79<>\"\",w!I79,\"error\")","v":"ذاکری"},{"$f":"w!AC79","v":"سه شنبه"},null,{"$f":"w!AF79","v":"10-12"},null,{"$f":"w!AI79","v":"210"}]
[" -  - -","error\nerror - error",{"$f":"IF($I80<>\"\",w!C80,\"error\")","v":"error"},{"$f":"IF($I80<>\"\",w!D80,\"error\")","v":"error"},{"$f":"IF($I80<>\"\",w!E80,\"error\")","v":"error"},{"$f":"IF($I80<>\"\",w!F80,\"error\")","v":"error"},{"$f":"IF($I80<>\"\",w!I80,\"error\")","v":"error"},{"$f":"w!AC80","v":""},null,{"$f":"w!AF80","v":""},null,{"$f":"w!AI80","v":"-"}]
[" -  - -","error\nerror - error",{"$f":"IF($I81<>\"\",w!C81,\"error\")","v":"error"},{"$f":"IF($I81<>\"\",w!D81,\"error\")","v":"error"},{"$f":"IF($I81<>\"\",w!E81,\"error\")","v":"error"},{"$f":"IF($I81<>\"\",w!F81,\"error\")","v":"error"},{"$f":"IF($I81<>\"\",w!I81,\"error\")","v":"error"},{"$f":"w!AC81","v":""},null,{"$f":"w!AF81","v":""},null,{"$f":"w!AI81","v":"-"}]

{"sheet":"R","index":5,"n_rows":29,"n_cols":1,"rows_kept":29,"cut":false,"hidden":false,"merged":[]}
["عنوان کامل"]
["رشته: علوم اقتصادی- گرایش: برنامه ريزي سيستمهاي اقتصادي - كارشناسي ارشد - دانشجویان ترم 02 - روزانه"]
["رشته: علوم اقتصادی- گرایش: برنامه ريزي سيستمهاي اقتصادي - كارشناسي ارشد - دانشجویان ترم 04 و بیشتر - روزانه"]
["رشته: علوم اقتصادی- گرایش: توسعه اقتصادي و برنامه ريزي - كارشناسي ارشد - دانشجویان ترم 02 - روزانه"]
["رشته: علوم اقتصادی- گرایش: توسعه اقتصادي و برنامه ريزي - كارشناسي ارشد - دانشجویان ترم 04 و بیشتر - روزانه"]
["رشته: مهندسي صنايع- گرایش: سيستمهاي كلان - كارشناسي ارشد - دانشجویان ترم 02 - روزانه"]
["رشته: مهندسي صنايع- گرایش: سيستمهاي كلان - كارشناسي ارشد - دانشجویان ترم 04 و بیشتر - روزانه"]
["رشته: سياست گذاري علم و فناوري- گرایش: - - دكتري تخصصي - دانشجویان ترم 02 - روزانه و پردیس"]
["رشته: كارآفريني- گرایش: كسب و كار جديد - كارشناسي ارشد - دانشجویان ترم 02 - روزانه"]
["رشته: كارآفريني- گرایش: كسب و كار جديد - كارشناسي ارشد - دانشجویان ترم 04 - روزانه"]
["رشته: كارآفريني- گرایش: كسب و كار جديد - كارشناسي ارشد - دانشجویان ترم 04 و بیشتر - روزانه"]
["رشته: مديريت فناوري اطلاعات- گرایش: كسب و كار الكترونيك - كارشناسي ارشد - دانشجویان ترم 02 - پردیس"]
["رشته: مديريت فناوري اطلاعات- گرایش: كسب و كار الكترونيك - كارشناسي ارشد - دانشجویان ترم 02 - روزانه"]
["رشته: مديريت فناوري اطلاعات- گرایش: كسب و كار الكترونيك - كارشناسي ارشد - دانشجویان ترم 04 و بیشتر - پردیس"]
["رشته: مديريت فناوري اطلاعات- گرایش: كسب و كار الكترونيك - كارشناسي ارشد - دانشجویان ترم 04 و بیشتر - روزانه"]
["رشته: مديريت تكنولوژي- گرایش: نوآوري تكنولوژي - سياست هاي تحقيق و توسعه - كارشناسي ارشد - دانشجویان ترم 02 - روزانه"]
["رشته: مديريت تكنولوژي- گرایش: نوآوري تكنولوژي - سياست هاي تحقيق و توسعه - كارشناسي ارشد - دانشجویان ترم 04 و بیشتر - روزانه"]
["رشته: مديريت تكنولوژي- گرایش: مديريت نوآوري - دكتري تخصصي - دانشجویان ترم 02 - روزانه و پردیس"]
["رشته: مديريت سازمان هاي دولتي ايران- گرایش: سياستگذاري دولتي(خط مشي گذاري عمومي) - دكتري تخصصي - دانشجویان ترم 02 - روزانه و پردیس"]
["رشته: مديريت كسب و كار- گرایش: بازاريابي - استراتژي - كارشناسي ارشد - دانشجویان ترم 02 - پردیس"]
["رشته: مديريت كسب و كار- گرایش: بازاريابي - استراتژي - كارشناسي ارشد - دانشجویان ترم 02 - روزانه"]
["رشته: مديريت كسب و كار- گرایش: بازاريابي - استراتژي - كارشناسي ارشد - دانشجویان ترم 04 - روزانه"]
["رشته: مديريت كسب و كار- گرایش: بازاريابي - كارشناسي ارشد - دانشجویان ترم 04 - روزانه"]
["رشته: مديريت كسب و كار- گرایش: بازاريابي - كارشناسي ارشد - دانشجویان ترم 04 - پردیس"]
["رشته: مديريت كسب و كار- گرایش: بازاريابي - استراتژي - كارشناسي ارشد - دانشجویان ترم 04 - پردیس"]
["رشته: مديريت كسب و كار- گرایش: استراتژي - كارشناسي ارشد - دانشجویان ترم 04 - پردیس"]
["رشته: مديريت كسب و كار- گرایش: استراتژي - كارشناسي ارشد - دانشجویان ترم 04 - روزانه"]
["رشته: مديريت كسب و كار- گرایش: بازاريابي - استراتژي - كارشناسي ارشد - دانشجویان ترم 04 و بیشتر - پردیس"]
["رشته: مديريت كسب و كار- گرایش: بازاريابي - استراتژي - كارشناسي ارشد - دانشجویان ترم 04 و بیشتر - روزانه"]

{"sheet":"C","index":6,"n_rows":82,"n_cols":22,"rows_kept":82,"cut":false,"hidden":false,"merged":[]}
["شنبه","یکشنبه","دوشنبه","سه شنبه","چهارشنبه","پنج شنبه","شنبه","یکشنبه","دوشنبه","سه شنبه","چهارشنبه","پنج شنبه","کلاس1","کلاس2","روز1","روز2","ساعت1","ساعت2","زمان 1","زمان 2",1,2]
[{"$f":"--NOT(ISBLANK(w!U2))","v":1},{"$f":"--NOT(ISBLANK(w!V2))","v":0},{"$f":"--NOT(ISBLANK(w!W2))","v":0},{"$f":"--NOT(ISBLANK(w!X2))","v":1},{"$f":"--NOT(ISBLANK(w!Y2))","v":0},{"$f":"--NOT(ISBLANK(w!Z2))","v":0},{"$f":"IF(A2=1,+COUNTIF($A2:A2,1),\"\")","v":1},{"$f":"IF(B2=1,+COUNTIF($A2:B2,1),\"\")","v":""},{"$f":"IF(C2=1,+COUNTIF($A2:C2,1),\"\")","v":""},{"$f":"IF(D2=1,+COUNTIF($A2:D2,1),\"\")","v":2},{"$f":"IF(E2=1,+COUNTIF($A2:E2,1),\"\")","v":""},{"$f":"IF(F2=1,+COUNTIF($A2:F2,1),\"\")","v":""},{"$f":"w!AH2","v":207},{"$f":"w!AI2","v":"208"},{"$f":"IFERROR(INDEX($G$1:$H$1,MATCH(COLUMNS($G2:G2),$G2:L2,0)),\"\")","v":"شنبه"},{"$f":"IFERROR(INDEX($G$1:$L$1,MATCH(COLUMNS($G2:H2),$G2:L2,0)),\"\")","v":"سه شنبه"},{"$f":"IFERROR(INDEX(w!$U2:'w'!$Z2,MATCH(COLUMNS($G2:G2),$G2:L2,0)),\"\")","v":"13-15"},{"$f":"IFERROR(INDEX(w!$U2:'w'!$Z2,MATCH(COLUMNS($G2:H2),$G2:L2,0)),\"\")","v":"10-12"},{"$f":"CONCATENATE(O2,\" - \",Q2)","v":"شنبه - 13-15"},{"$f":"CONCATENATE(P2,\" - \",R2)","v":"سه شنبه - 10-12"},{"$f":"CONCATENATE(M2,\" - \",O2,\" - \",Q2)","v":"207 - شنبه - 13-15"},{"$f":"CONCATENATE(N2,\" - \",P2,\" - \",R2)","v":"208 - سه شنبه - 10-12"}]
[{"$f":"--NOT(ISBLANK(w!U3))","v":1},{"$f":"--NOT(ISBLANK(w!V3))","v":0},{"$f":"--NOT(ISBLANK(w!W3))","v":0},{"$f":"--NOT(ISBLANK(w!X3))","v":1},{"$f":"--NOT(ISBLANK(w!Y3))","v":0},{"$f":"--NOT(ISBLANK(w!Z3))","v":0},{"$f":"IF(A3=1,+COUNTIF($A3:A3,1),\"\")","v":1},{"$f":"IF(B3=1,+COUNTIF($A3:B3,1),\"\")","v":""},{"$f":"IF(C3=1,+COUNTIF($A3:C3,1),\"\")","v":""},{"$f":"IF(D3=1,+COUNTIF($A3:D3,1),\"\")","v":2},{"$f":"IF(E3=1,+COUNTIF($A3:E3,1),\"\")","v":""},{"$f":"IF(F3=1,+COUNTIF($A3:F3,1),\"\")","v":""},{"$f":"w!AH3","v":"207"},{"$f":"w!AI3","v":"208"},{"$f":"IFERROR(INDEX($G$1:$H$1,MATCH(COLUMNS($G3:G3),$G3:L3,0)),\"\")","v":"شنبه"},{"$f":"IFERROR(INDEX($G$1:$L$1,MATCH(COLUMNS($G3:H3),$G3:L3,0)),\"\")","v":"سه شنبه"},{"$f":"IFERROR(INDEX(w!$U3:'w'!$Z3,MATCH(COLUMNS($G3:G3),$G3:L3,0)),\"\")","v":"10-12"},{"$f":"IFERROR(INDEX(w!$U3:'w'!$Z3,MATCH(COLUMNS($G3:H3),$G3:L3,0)),\"\")","v":"15-17"},"شنبه - 10-12","سه شنبه - 15-17",{"$f":"CONCATENATE(M3,\" - \",O3,\" - \",Q3)","v":"207 - شنبه - 10-12"},{"$f":"CONCATENATE(N3,\" - \",P3,\" - \",R3)","v":"208 - سه شنبه - 15-17"}]
[{"$f":"--NOT(ISBLANK(w!U4))","v":1},{"$f":"--NOT(ISBLANK(w!V4))","v":0},{"$f":"--NOT(ISBLANK(w!W4))","v":0},{"$f":"--NOT(ISBLANK(w!X4))","v":1},{"$f":"--NOT(ISBLANK(w!Y4))","v":0},{"$f":"--NOT(ISBLANK(w!Z4))","v":0},{"$f":"IF(A4=1,+COUNTIF($A4:A4,1),\"\")","v":1},{"$f":"IF(B4=1,+COUNTIF($A4:B4,1),\"\")","v":""},{"$f":"IF(C4=1,+COUNTIF($A4:C4,1),\"\")","v":""},{"$f":"IF(D4=1,+COUNTIF($A4:D4,1),\"\")","v":2},{"$f":"IF(E4=1,+COUNTIF($A4:E4,1),\"\")","v":""},{"$f":"IF(F4=1,+COUNTIF($A4:F4,1),\"\")","v":""},{"$f":"w!AH4","v":"207"},{"$f":"w!AI4","v":"208"},{"$f":"IFERROR(INDEX($G$1:$H$1,MATCH(COLUMNS($G4:G4),$G4:L4,0)),\"\")","v":"شنبه"},{"$f":"IFERROR(INDEX($G$1:$L$1,MATCH(COLUMNS($G4:H4),$G4:L4,0)),\"\")","v":"سه شنبه"},{"$f":"IFERROR(INDEX(w!$U4:'w'!$Z4,MATCH(COLUMNS($G4:G4),$G4:L4,0)),\"\")","v":"15-17"},{"$f":"IFERROR(INDEX(w!$U4:'w'!$Z4,MATCH(COLUMNS($G4:H4),$G4:L4,0)),\"\")","v":"13-15"},"شنبه - 15-17","سه شنبه - 13-15","207 - شنبه - 15-17","208 - سه شنبه - 13-15"]
[{"$f":"--NOT(ISBLANK(w!U5))","v":1},{"$f":"--NOT(ISBLANK(w!V5))","v":0},{"$f":"--NOT(ISBLANK(w!W5))","v":0},{"$f":"--NOT(ISBLANK(w!X5))","v":1},{"$f":"--NOT(ISBLANK(w!Y5))","v":0},{"$f":"--NOT(ISBLANK(w!Z5))","v":0},{"$f":"IF(A5=1,+COUNTIF($A5:A5,1),\"\")","v":1},{"$f":"IF(B5=1,+COUNTIF($A5:B5,1),\"\")","v":""},{"$f":"IF(C5=1,+COUNTIF($A5:C5,1),\"\")","v":""},{"$f":"IF(D5=1,+COUNTIF($A5:D5,1),\"\")","v":2},{"$f":"IF(E5=1,+COUNTIF($A5:E5,1),\"\")","v":""},{"$f":"IF(F5=1,+COUNTIF($A5:F5,1),\"\")","v":""},{"$f":"w!AH5","v":"207"},{"$f":"w!AI5","v":"207"},{"$f":"IFERROR(INDEX($G$1:$H$1,MATCH(COLUMNS($G5:G5),$G5:L5,0)),\"\")","v":"شنبه"},{"$f":"IFERROR(INDEX($G$1:$L$1,MATCH(COLUMNS($G5:H5),$G5:L5,0)),\"\")","v":"سه شنبه"},{"$f":"IFERROR(INDEX(w!$U5:'w'!$Z5,MATCH(COLUMNS($G5:G5),$G5:L5,0)),\"\")","v":"8-10"},{"$f":"IFERROR(INDEX(w!$U5:'w'!$Z5,MATCH(COLUMNS($G5:H5),$G5:L5,0)),\"\")","v":"8-10"},"شنبه - 8-10","سه شنبه - 8-10","207 - شنبه - 8-10","207 - سه شنبه - 8-10"]
[{"$f":"--NOT(ISBLANK(w!U6))","v":0},{"$f":"--NOT(ISBLANK(w!V6))","v":0},{"$f":"--NOT(ISBLANK(w!W6))","v":0},{"$f":"--NOT(ISBLANK(w!X6))","v":0},{"$f":"--NOT(ISBLANK(w!Y6))","v":0},{"$f":"--NOT(ISBLANK(w!Z6))","v":0},{"$f":"IF(A6=1,+COUNTIF($A6:A6,1),\"\")","v":""},{"$f":"IF(B6=1,+COUNTIF($A6:B6,1),\"\")","v":""},{"$f":"IF(C6=1,+COUNTIF($A6:C6,1),\"\")","v":""},{"$f":"IF(D6=1,+COUNTIF($A6:D6,1),\"\")","v":""},{"$f":"IF(E6=1,+COUNTIF($A6:E6,1),\"\")","v":""},{"$f":"IF(F6=1,+COUNTIF($A6:F6,1),\"\")","v":""},{"$f":"w!AH6","v":""},{"$f":"w!AI6","v":"-"},{"$f":"IFERROR(INDEX($G$1:$H$1,MATCH(COLUMNS($G6:G6),$G6:L6,0)),\"\")","v":""},{"$f":"IFERROR(INDEX($G$1:$L$1,MATCH(COLUMNS($G6:H6),$G6:L6,0)),\"\")","v":""},{"$f":"IFERROR(INDEX(w!$U6:'w'!$Z6,MATCH(COLUMNS($G6:G6),$G6:L6,0)),\"\")","v":""},{"$f":"IFERROR(INDEX(w!$U6:'w'!$Z6,MATCH(COLUMNS($G6:H6),$G6:L6,0)),\"\")","v":""}," - "," - "," -  - ","- -  - "]
[{"$f":"--NOT(ISBLANK(w!U7))","v":1},{"$f":"--NOT(ISBLANK(w!V7))","v":0},{"$f":"--NOT(ISBLANK(w!W7))","v":1},{"$f":"--NOT(ISBLANK(w!X7))","v":0},{"$f":"--NOT(ISBLANK(w!Y7))","v":0},{"$f":"--NOT(ISBLANK(w!Z7))","v":0},{"$f":"IF(A7=1,+COUNTIF($A7:A7,1),\"\")","v":1},{"$f":"IF(B7=1,+COUNTIF($A7:B7,1),\"\")","v":""},{"$f":"IF(C7=1,+COUNTIF($A7:C7,1),\"\")","v":2},{"$f":"IF(D7=1,+COUNTIF($A7:D7,1),\"\")","v":""},{"$f":"IF(E7=1,+COUNTIF($A7:E7,1),\"\")","v":""},{"$f":"IF(F7=1,+COUNTIF($A7:F7,1),\"\")","v":""},{"$f":"w!AH7","v":"208"},{"$f":"w!AI7","v":"208"},{"$f":"IFERROR(INDEX($G$1:$H$1,MATCH(COLUMNS($G7:G7),$G7:L7,0)),\"\")","v":"شنبه"},{"$f":"IFERROR(INDEX($G$1:$L$1,MATCH(COLUMNS($G7:H7),$G7:L7,0)),\"\")","v":"دوشنبه"},{"$f":"IFERROR(INDEX(w!$U7:'w'!$Z7,MATCH(COLUMNS($G7:G7),$G7:L7,0)),\"\")","v":"8-10"},{"$f":"IFERROR(INDEX(w!$U7:'w'!$Z7,MATCH(COLUMNS($G7:H7),$G7:L7,0)),\"\")","v":"8-10"},"شنبه - 8-10","دوشنبه - 8-10","208 - شنبه - 8-10","208 - دوشنبه - 8-10"]
[{"$f":"--NOT(ISBLANK(w!U8))","v":1},{"$f":"--NOT(ISBLANK(w!V8))","v":0},{"$f":"--NOT(ISBLANK(w!W8))","v":1},{"$f":"--NOT(ISBLANK(w!X8))","v":0},{"$f":"--NOT(ISBLANK(w!Y8))","v":0},{"$f":"--NOT(ISBLANK(w!Z8))","v":0},{"$f":"IF(A8=1,+COUNTIF($A8:A8,1),\"\")","v":1},{"$f":"IF(B8=1,+COUNTIF($A8:B8,1),\"\")","v":""},{"$f":"IF(C8=1,+COUNTIF($A8:C8,1),\"\")","v":2},{"$f":"IF(D8=1,+COUNTIF($A8:D8,1),\"\")","v":""},{"$f":"IF(E8=1,+COUNTIF($A8:E8,1),\"\")","v":""},{"$f":"IF(F8=1,+COUNTIF($A8:F8,1),\"\")","v":""},{"$f":"w!AH8","v":"208"},{"$f":"w!AI8","v":"208"},{"$f":"IFERROR(INDEX($G$1:$L$1,MATCH(COLUMNS($G8:G8),$G8:L8,0)),\"\")","v":"شنبه"},{"$f":"IFERROR(INDEX($G$1:$L$1,MATCH(COLUMNS($G8:H8),$G8:L8,0)),\"\")","v":"دوشنبه"},{"$f":"IFERROR(INDEX(w!$U8:'w'!$Z8,MATCH(COLUMNS($G8:G8),$G8:L8,0)),\"\")","v":"13-15"},{"$f":"IFERROR(INDEX(w!$U8:'w'!$Z8,MATCH(COLUMNS($G8:H8),$G8:L8,0)),\"\")","v":"13-15"},"شنبه - 13-15","دوشنبه - 13-15","208 - شنبه - 13-15","208 - دوشنبه - 13-15"]
[{"$f":"--NOT(ISBLANK(w!U9))","v":1},{"$f":"--NOT(ISBLANK(w!V9))","v":0},{"$f":"--NOT(ISBLANK(w!W9))","v":1},{"$f":"--NOT(ISBLANK(w!X9))","v":0},{"$f":"--NOT(ISBLANK(w!Y9))","v":0},{"$f":"--NOT(ISBLANK(w!Z9))","v":0},{"$f":"IF(A9=1,+COUNTIF($A9:A9,1),\"\")","v":1},{"$f":"IF(B9=1,+COUNTIF($A9:B9,1),\"\")","v":""},{"$f":"IF(C9=1,+COUNTIF($A9:C9,1),\"\")","v":2},{"$f":"IF(D9=1,+COUNTIF($A9:D9,1),\"\")","v":""},{"$f":"IF(E9=1,+COUNTIF($A9:E9,1),\"\")","v":""},{"$f":"IF(F9=1,+COUNTIF($A9:F9,1),\"\")","v":""},{"$f":"w!AH9","v":"208"},{"$f":"w!AI9","v":"208"},{"$f":"IFERROR(INDEX($G$1:$L$1,MATCH(COLUMNS($G9:G9),$G9:L9,0)),\"\")","v":"شنبه"},{"$f":"IFERROR(INDEX($G$1:$L$1,MATCH(COLUMNS($G9:H9),$G9:L9,0)),\"\")","v":"دوشنبه"},{"$f":"IFERROR(INDEX(w!$U9:'w'!$Z9,MATCH(COLUMNS($G9:G9),$G9:L9,0)),\"\")","v":"15-17"},{"$f":"IFERROR(INDEX(w!$U9:'w'!$Z9,MATCH(COLUMNS($G9:H9),$G9:L9,0)),\"\")","v":"15-17"},"شنبه - 15-17","دوشنبه - 15-17","208 - شنبه - 15-17","208 - دوشنبه - 15-17"]
[{"$f":"--NOT(ISBLANK(w!U10))","v":0},{"$f":"--NOT(ISBLANK(w!V10))","v":0},{"$f":"--NOT(ISBLANK(w!W10))","v":0},{"$f":"--NOT(ISBLANK(w!X10))","v":0},{"$f":"--NOT(ISBLANK(w!Y10))","v":0},{"$f":"--NOT(ISBLANK(w!Z10))","v":0},{"$f":"IF(A10=1,+COUNTIF($A10:A10,1),\"\")","v":""},{"$f":"IF(B10=1,+COUNTIF($A10:B10,1),\"\")","v":""},{"$f":"IF(C10=1,+COUNTIF($A10:C10,1),\"\")","v":""},{"$f":"IF(D10=1,+COUNTIF($A10:D10,1),\"\")","v":""},{"$f":"IF(E10=1,+COUNTIF($A10:E10,1),\"\")","v":""},{"$f":"IF(F10=1,+COUNTIF($A10:F10,1),\"\")","v":""},{"$f":"w!AH10","v":""},{"$f":"w!AI10","v":"-"},{"$f":"IFERROR(INDEX($G$1:$L$1,MATCH(COLUMNS($G10:G10),$G10:L10,0)),\"\")","v":""},{"$f":"IFERROR(INDEX($G$1:$L$1,MATCH(COLUMNS($G10:H10),$G10:L10,0)),\"\")","v":""},{"$f":"IFERROR(INDEX(w!$U10:'w'!$Z10,MATCH(COLUMNS($G10:G10),$G10:L10,0)),\"\")","v":""},{"$f":"IFERROR(INDEX(w!$U10:'w'!$Z10,MATCH(COLUMNS($G10:H10),$G10:L10,0)),\"\")","v":""}," - "," - "," -  - ","- -  - "]
[{"$f":"--NOT(ISBLANK(w!U11))","v":0},{"$f":"--NOT(ISBLANK(w!V11))","v":1},{"$f":"--NOT(ISBLANK(w!W11))","v":0},{"$f":"--NOT(ISBLANK(w!X11))","v":1},{"$f":"--NOT(ISBLANK(w!Y11))","v":0},{"$f":"--NOT(ISBLANK(w!Z11))","v":0},{"$f":"IF(A11=1,+COUNTIF($A11:A11,1),\"\")","v":""},{"$f":"IF(B11=1,+COUNTIF($A11:B11,1),\"\")","v":1},{"$f":"IF(C11=1,+COUNTIF($A11:C11,1),\"\")","v":""},{"$f":"IF(D11=1,+COUNTIF($A11:D11,1),\"\")","v":2},{"$f":"IF(E11=1,+COUNTIF($A11:E11,1),\"\")","v":""},{"$f":"IF(F11=1,+COUNTIF($A11:F11,1),\"\")","v":""},{"$f":"w!AH11","v":"207"},{"$f":"w!AI11","v":"208"},{"$f":"IFERROR(INDEX($G$1:$L$1,MATCH(COLUMNS($G11:G11),$G11:L11,0)),\"\")","v":"یکشنبه"},{"$f":"IFERROR(INDEX($G$1:$L$1,MATCH(COLUMNS($G11:H11),$G11:L11,0)),\"\")","v":"سه شنبه"},{"$f":"IFERROR(INDEX(w!$U11:'w'!$Z11,MATCH(COLUMNS($G11:G11),$G11:L11,0)),\"\")","v":"8-10"},{"$f":"IFERROR(INDEX(w!$U11:'w'!$Z11,MATCH(COLUMNS($G11:H11),$G11:L11,0)),\"\")","v":"8-10"},"یکشنبه - 8-10","سه شنبه - 8-10","207 - یکشنبه - 8-10","208 - سه شنبه - 8-10"]
[{"$f":"--NOT(ISBLANK(w!U12))","v":0},{"$f":"--NOT(ISBLANK(w!V12))","v":1},{"$f":"--NOT(ISBLANK(w!W12))","v":0},{"$f":"--NOT(ISBLANK(w!X12))","v":1},{"$f":"--NOT(ISBLANK(w!Y12))","v":0},{"$f":"--NOT(ISBLANK(w!Z12))","v":0},{"$f":"IF(A12=1,+COUNTIF($A12:A12,1),\"\")","v":""},{"$f":"IF(B12=1,+COUNTIF($A12:B12,1),\"\")","v":1},{"$f":"IF(C12=1,+COUNTIF($A12:C12,1),\"\")","v":""},{"$f":"IF(D12=1,+COUNTIF($A12:D12,1),\"\")","v":2},{"$f":"IF(E12=1,+COUNTIF($A12:E12,1),\"\")","v":""},{"$f":"IF(F12=1,+COUNTIF($A12:F12,1),\"\")","v":""},{"$f":"w!AH12","v":"207"},{"$f":"w!AI12","v":"207"},{"$f":"IFERROR(INDEX($G$1:$L$1,MATCH(COLUMNS($G12:G12),$G12:L12,0)),\"\")","v":"یکشنبه"},{"$f":"IFERROR(INDEX($G$1:$L$1,MATCH(COLUMNS($G12:H12),$G12:L12,0)),\"\")","v":"سه شنبه"},{"$f":"IFERROR(INDEX(w!$U12:'w'!$Z12,MATCH(COLUMNS($G12:G12),$G12:L12,0)),\"\")","v":"10-12"},{"$f":"IFERROR(INDEX(w!$U12:'w'!$Z12,MATCH(COLUMNS($G12:H12),$G12:L12,0)),\"\")","v":"10-12"},"یکشنبه - 10-12","سه شنبه - 10-12","207 - یکشنبه - 10-12","207 - سه شنبه - 10-12"]
[{"$f":"--NOT(ISBLANK(w!U13))","v":0},{"$f":"--NOT(ISBLANK(w!V13))","v":1},{"$f":"--NOT(ISBLANK(w!W13))","v":0},{"$f":"--NOT(ISBLANK(w!X13))","v":1},{"$f":"--NOT(ISBLANK(w!Y13))","v":0},{"$f":"--NOT(ISBLANK(w!Z13))","v":0},{"$f":"IF(A13=1,+COUNTIF($A13:A13,1),\"\")","v":""},{"$f":"IF(B13=1,+COUNTIF($A13:B13,1),\"\")","v":1},{"$f":"IF(C13=1,+COUNTIF($A13:C13,1),\"\")","v":""},{"$f":"IF(D13=1,+COUNTIF($A13:D13,1),\"\")","v":2},{"$f":"IF(E13=1,+COUNTIF($A13:E13,1),\"\")","v":""},{"$f":"IF(F13=1,+COUNTIF($A13:F13,1),\"\")","v":""},{"$f":"w!AH13","v":"207"},{"$f":"w!AI13","v":"207"},{"$f":"IFERROR(INDEX($G$1:$L$1,MATCH(COLUMNS($G13:G13),$G13:L13,0)),\"\")","v":"یکشنبه"},{"$f":"IFERROR(INDEX($G$1:$L$1,MATCH(COLUMNS($G13:H13),$G13:L13,0)),\"\")","v":"سه شنبه"},{"$f":"IFERROR(INDEX(w!$U13:'w'!$Z13,MATCH(COLUMNS($G13:G13),$G13:L13,0)),\"\")","v":"13-15"},{"$f":"IFERROR(INDEX(w!$U13:'w'!$Z13,MATCH(COLUMNS($G13:H13),$G13:L13,0)),\"\")","v":"13-15"},"یکشنبه - 13-15","سه شنبه - 13-15","207 - یکشنبه - 13-15","207 - سه شنبه - 13-15"]
[{"$f":"--NOT(ISBLANK(w!U14))","v":0},{"$f":"--NOT(ISBLANK(w!V14))","v":1},{"$f":"--NOT(ISBLANK(w!W14))","v":0},{"$f":"--NOT(ISBLANK(w!X14))","v":1},{"$f":"--NOT(ISBLANK(w!Y14))","v":0},{"$f":"--NOT(ISBLANK(w!Z14))","v":0},{"$f":"IF(A14=1,+COUNTIF($A14:A14,1),\"\")","v":""},{"$f":"IF(B14=1,+COUNTIF($A14:B14,1),\"\")","v":1},{"$f":"IF(C14=1,+COUNTIF($A14:C14,1),\"\")","v":""},{"$f":"IF(D14=1,+COUNTIF($A14:D14,1),\"\")","v":2},{"$f":"IF(E14=1,+COUNTIF($A14:E14,1),\"\")","v":""},{"$f":"IF(F14=1,+COUNTIF($A14:F14,1),\"\")","v":""},{"$f":"w!AH14","v":"207"},{"$f":"w!AI14","v":"207"},{"$f":"IFERROR(INDEX($G$1:$L$1,MATCH(COLUMNS($G14:G14),$G14:L14,0)),\"\")","v":"یکشنبه"},{"$f":"IFERROR(INDEX($G$1:$L$1,MATCH(COLUMNS($G14:H14),$G14:L14,0)),\"\")","v":"سه شنبه"},{"$f":"IFERROR(INDEX(w!$U14:'w'!$Z14,MATCH(COLUMNS($G14:G14),$G14:L14,0)),\"\")","v":"15-17"},{"$f":"IFERROR(INDEX(w!$U14:'w'!$Z14,MATCH(COLUMNS($G14:H14),$G14:L14,0)),\"\")","v":"15-17"},"یکشنبه - 15-17","سه شنبه - 15-17","207 - یکشنبه - 15-17","207 - سه شنبه - 15-17"]
[{"$f":"--NOT(ISBLANK(w!U15))","v":0},{"$f":"--NOT(ISBLANK(w!V15))","v":0},{"$f":"--NOT(ISBLANK(w!W15))","v":0},{"$f":"--NOT(ISBLANK(w!X15))","v":0},{"$f":"--NOT(ISBLANK(w!Y15))","v":0},{"$f":"--NOT(ISBLANK(w!Z15))","v":0},{"$f":"IF(A15=1,+COUNTIF($A15:A15,1),\"\")","v":""},{"$f":"IF(B15=1,+COUNTIF($A15:B15,1),\"\")","v":""},{"$f":"IF(C15=1,+COUNTIF($A15:C15,1),\"\")","v":""},{"$f":"IF(D15=1,+COUNTIF($A15:D15,1),\"\")","v":""},{"$f":"IF(E15=1,+COUNTIF($A15:E15,1),\"\")","v":""},{"$f":"IF(F15=1,+COUNTIF($A15:F15,1),\"\")","v":""},{"$f":"w!AH15","v":""},{"$f":"w!AI15","v":"-"},{"$f":"IFERROR(INDEX($G$1:$L$1,MATCH(COLUMNS($G15:G15),$G15:L15,0)),\"\")","v":""},{"$f":"IFERROR(INDEX($G$1:$L$1,MATCH(COLUMNS($G15:H15),$G15:L15,0)),\"\")","v":""},{"$f":"IFERROR(INDEX(w!$U15:'w'!$Z15,MATCH(COLUMNS($G15:G15),$G15:L15,0)),\"\")","v":""},{"$f":"IFERROR(INDEX(w!$U15:'w'!$Z15,MATCH(COLUMNS($G15:H15),$G15:L15,0)),\"\")","v":""}," - "," - "," -  - ","- -  - "]
[{"$f":"--NOT(ISBLANK(w!U16))","v":0},{"$f":"--NOT(ISBLANK(w!V16))","v":0},{"$f":"--NOT(ISBLANK(w!W16))","v":0},{"$f":"--NOT(ISBLANK(w!X16))","v":0},{"$f":"--NOT(ISBLANK(w!Y16))","v":1},{"$f":"--NOT(ISBLANK(w!Z16))","v":0},{"$f":"IF(A16=1,+COUNTIF($A16:A16,1),\"\")","v":""},{"$f":"IF(B16=1,+COUNTIF($A16:B16,1),\"\")","v":""},{"$f":"IF(C16=1,+COUNTIF($A16:C16,1),\"\")","v":""},{"$f":"IF(D16=1,+COUNTIF($A16:D16,1),\"\")","v":""},{"$f":"IF(E16=1,+COUNTIF($A16:E16,1),\"\")","v":1},{"$f":"IF(F16=1,+COUNTIF($A16:F16,1),\"\")","v":""},{"$f":"w!AH16","v":"207"},{"$f":"w!AI16","v":"-"},{"$f":"IFERROR(INDEX($G$1:$L$1,MATCH(COLUMNS($G16:G16),$G16:L16,0)),\"\")","v":"چهارشنبه"},{"$f":"IFERROR(INDEX($G$1:$L$1,MATCH(COLUMNS($G16:H16),$G16:L16,0)),\"\")","v":""},{"$f":"IFERROR(INDEX(w!$U16:'w'!$Z16,MATCH(COLUMNS($G16:G16),$G16:L16,0)),\"\")","v":"10-12"},{"$f":"IFERROR(INDEX(w!$U16:'w'!$Z16,MATCH(COLUMNS($G16:H16),$G16:L16,0)),\"\")","v":""},"چهارشنبه - 10-12"," - ","207 - چهارشنبه - 10-12","- -  - "]
[{"$f":"--NOT(ISBLANK(w!U17))","v":0},{"$f":"--NOT(ISBLANK(w!V17))","v":0},{"$f":"--NOT(ISBLANK(w!W17))","v":0},{"$f":"--NOT(ISBLANK(w!X17))","v":0},{"$f":"--NOT(ISBLANK(w!Y17))","v":1},{"$f":"--NOT(ISBLANK(w!Z17))","v":0},{"$f":"IF(A17=1,+COUNTIF($A17:A17,1),\"\")","v":""},{"$f":"IF(B17=1,+COUNTIF($A17:B17,1),\"\")","v":""},{"$f":"IF(C17=1,+COUNTIF($A17:C17,1),\"\")","v":""},{"$f":"IF(D17=1,+COUNTIF($A17:D17,1),\"\")","v":""},{"$f":"IF(E17=1,+COUNTIF($A17:E17,1),\"\")","v":1},{"$f":"IF(F17=1,+COUNTIF($A17:F17,1),\"\")","v":""},{"$f":"w!AH17","v":"207"},{"$f":"w!AI17","v":"-"},{"$f":"IFERROR(INDEX($G$1:$L$1,MATCH(COLUMNS($G17:G17),$G17:L17,0)),\"\")","v":"چهارشنبه"},{"$f":"IFERROR(INDEX($G$1:$L$1,MATCH(COLUMNS($G17:H17),$G17:L17,0)),\"\")","v":""},{"$f":"IFERROR(INDEX(w!$U17:'w'!$Z17,MATCH(COLUMNS($G17:G17),$G17:L17,0)),\"\")","v":"8-10"},{"$f":"IFERROR(INDEX(w!$U17:'w'!$Z17,MATCH(COLUMNS($G17:H17),$G17:L17,0)),\"\")","v":""},"چهارشنبه - 8-10"," - ","207 - چهارشنبه - 8-10","- -  - "]
[{"$f":"--NOT(ISBLANK(w!U18))","v":0},{"$f":"--NOT(ISBLANK(w!V18))","v":0},{"$f":"--NOT(ISBLANK(w!W18))","v":0},{"$f":"--NOT(ISBLANK(w!X18))","v":0},{"$f":"--NOT(ISBLANK(w!Y18))","v":1},{"$f":"--NOT(ISBLANK(w!Z18))","v":0},{"$f":"IF(A18=1,+COUNTIF($A18:A18,1),\"\")","v":""},{"$f":"IF(B18=1,+COUNTIF($A18:B18,1),\"\")","v":""},{"$f":"IF(C18=1,+COUNTIF($A18:C18,1),\"\")","v":""},{"$f":"IF(D18=1,+COUNTIF($A18:D18,1),\"\")","v":""},{"$f":"IF(E18=1,+COUNTIF($A18:E18,1),\"\")","v":1},{"$f":"IF(F18=1,+COUNTIF($A18:F18,1),\"\")","v":""},{"$f":"w!AH18","v":"207"},{"$f":"w!AI18","v":"-"},{"$f":"IFERROR(INDEX($G$1:$L$1,MATCH(COLUMNS($G18:G18),$G18:L18,0)),\"\")","v":"چهارشنبه"},{"$f":"IFERROR(INDEX($G$1:$L$1,MATCH(COLUMNS($G18:H18),$G18:L18,0)),\"\")","v":""},{"$f":"IFERROR(INDEX(w!$U18:'w'!$Z18,MATCH(COLUMNS($G18:G18),$G18:L18,0)),\"\")","v":"15-17"},{"$f":"IFERROR(INDEX(w!$U18:'w'!$Z18,MATCH(COLUMNS($G18:H18),$G18:L18,0)),\"\")","v":""},"چهارشنبه - 15-17"," - ","207 - چهارشنبه - 15-17","- -  - "]
[{"$f":"--NOT(ISBLANK(w!U19))","v":1},{"$f":"--NOT(ISBLANK(w!V19))","v":0},{"$f":"--NOT(ISBLANK(w!W19))","v":0},{"$f":"--NOT(ISBLANK(w!X19))","v":0},{"$f":"--NOT(ISBLANK(w!Y19))","v":0},{"$f":"--NOT(ISBLANK(w!Z19))","v":0},{"$f":"IF(A19=1,+COUNTIF($A19:A19,1),\"\")","v":1},{"$f":"IF(B19=1,+COUNTIF($A19:B19,1),\"\")","v":""},{"$f":"IF(C19=1,+COUNTIF($A19:C19,1),\"\")","v":""},{"$f":"IF(D19=1,+COUNTIF($A19:D19,1),\"\")","v":""},{"$f":"IF(E19=1,+COUNTIF($A19:E19,1),\"\")","v":""},{"$f":"IF(F19=1,+COUNTIF($A19:F19,1),\"\")","v":""},{"$f":"w!AH19","v":"209"},{"$f":"w!AI19","v":"-"},{"$f":"IFERROR(INDEX($G$1:$L$1,MATCH(COLUMNS($G19:G19),$G19:L19,0)),\"\")","v":"شنبه"},{"$f":"IFERROR(INDEX($G$1:$L$1,MATCH(COLUMNS($G19:H19),$G19:L19,0)),\"\")","v":""},{"$f":"IFERROR(INDEX(w!$U19:'w'!$Z19,MATCH(COLUMNS($G19:G19),$G19:L19,0)),\"\")","v":"13-15"},{"$f":"IFERROR(INDEX(w!$U19:'w'!$Z19,MATCH(COLUMNS($G19:H19),$G19:L19,0)),\"\")","v":""},"شنبه - 13-15"," - ","209 - شنبه - 13-15","- -  - "]
[{"$f":"--NOT(ISBLANK(w!U20))","v":0},{"$f":"--NOT(ISBLANK(w!V20))","v":0},{"$f":"--NOT(ISBLANK(w!W20))","v":0},{"$f":"--NOT(ISBLANK(w!X20))","v":0},{"$f":"--NOT(ISBLANK(w!Y20))","v":1},{"$f":"--NOT(ISBLANK(w!Z20))","v":0},{"$f":"IF(A20=1,+COUNTIF($A20:A20,1),\"\")","v":""},{"$f":"IF(B20=1,+COUNTIF($A20:B20,1),\"\")","v":""},{"$f":"IF(C20=1,+COUNTIF($A20:C20,1),\"\")","v":""},{"$f":"IF(D20=1,+COUNTIF($A20:D20,1),\"\")","v":""},{"$f":"IF(E20=1,+COUNTIF($A20:E20,1),\"\")","v":1},{"$f":"IF(F20=1,+COUNTIF($A20:F20,1),\"\")","v":""},{"$f":"w!AH20","v":"207"},{"$f":"w!AI20","v":"-"},{"$f":"IFERROR(INDEX($G$1:$L$1,MATCH(COLUMNS($G20:G20),$G20:L20,0)),\"\")","v":"چهارشنبه"},{"$f":"IFERROR(INDEX($G$1:$L$1,MATCH(COLUMNS($G20:H20),$G20:L20,0)),\"\")","v":""},{"$f":"IFERROR(INDEX(w!$U20:'w'!$Z20,MATCH(COLUMNS($G20:G20),$G20:L20,0)),\"\")","v":"13-15"},{"$f":"IFERROR(INDEX(w!$U20:'w'!$Z20,MATCH(COLUMNS($G20:H20),$G20:L20,0)),\"\")","v":""},"چهارشنبه - 13-15"," - ","207 - چهارشنبه - 13-15","- -  - "]
[{"$f":"--NOT(ISBLANK(w!U21))","v":1},{"$f":"--NOT(ISBLANK(w!V21))","v":0},{"$f":"--NOT(ISBLANK(w!W21))","v":0},{"$f":"--NOT(ISBLANK(w!X21))","v":0},{"$f":"--NOT(ISBLANK(w!Y21))","v":0},{"$f":"--NOT(ISBLANK(w!Z21))","v":0},{"$f":"IF(A21=1,+COUNTIF($A21:A21,1),\"\")","v":1},{"$f":"IF(B21=1,+COUNTIF($A21:B21,1),\"\")","v":""},{"$f":"IF(C21=1,+COUNTIF($A21:C21,1),\"\")","v":""},{"$f":"IF(D21=1,+COUNTIF($A21:D21,1),\"\")","v":""},{"$f":"IF(E21=1,+COUNTIF($A21:E21,1),\"\")","v":""},{"$f":"IF(F21=1,+COUNTIF($A21:F21,1),\"\")","v":""},{"$f":"w!AH21","v":"آزم"},{"$f":"w!AI21","v":"-"},{"$f":"IFERROR(INDEX($G$1:$L$1,MATCH(COLUMNS($G21:G21),$G21:L21,0)),\"\")","v":"شنبه"},{"$f":"IFERROR(INDEX($G$1:$L$1,MATCH(COLUMNS($G21:H21),$G21:L21,0)),\"\")","v":""},{"$f":"IFERROR(INDEX(w!$U21:'w'!$Z21,MATCH(COLUMNS($G21:G21),$G21:L21,0)),\"\")","v":"15-17"},{"$f":"IFERROR(INDEX(w!$U21:'w'!$Z21,MATCH(COLUMNS($G21:H21),$G21:L21,0)),\"\")","v":""},"شنبه - 15-17"," - ","آزم - شنبه - 15-17","- -  - "]
[{"$f":"--NOT(ISBLANK(w!U22))","v":0},{"$f":"--NOT(ISBLANK(w!V22))","v":0},{"$f":"--NOT(ISBLANK(w!W22))","v":0},{"$f":"--NOT(ISBLANK(w!X22))","v":0},{"$f":"--NOT(ISBLANK(w!Y22))","v":1},{"$f":"--NOT(ISBLANK(w!Z22))","v":0},{"$f":"IF(A22=1,+COUNTIF($A22:A22,1),\"\")","v":""},{"$f":"IF(B22=1,+COUNTIF($A22:B22,1),\"\")","v":""},{"$f":"IF(C22=1,+COUNTIF($A22:C22,1),\"\")","v":""},{"$f":"IF(D22=1,+COUNTIF($A22:D22,1),\"\")","v":""},{"$f":"IF(E22=1,+COUNTIF($A22:E22,1),\"\")","v":1},{"$f":"IF(F22=1,+COUNTIF($A22:F22,1),\"\")","v":""},{"$f":"w!AH22","v":"208"},{"$f":"w!AI22","v":"-"},{"$f":"IFERROR(INDEX($G$1:$L$1,MATCH(COLUMNS($G22:G22),$G22:L22,0)),\"\")","v":"چهارشنبه"},{"$f":"IFERROR(INDEX($G$1:$L$1,MATCH(COLUMNS($G22:H22),$G22:L22,0)),\"\")","v":""},{"$f":"IFERROR(INDEX(w!$U22:'w'!$Z22,MATCH(COLUMNS($G22:G22),$G22:L22,0)),\"\")","v":"10-12"},{"$f":"IFERROR(INDEX(w!$U22:'w'!$Z22,MATCH(COLUMNS($G22:H22),$G22:L22,0)),\"\")","v":""},"چهارشنبه - 10-12"," - ","208 - چهارشنبه - 10-12","- -  - "]
[{"$f":"--NOT(ISBLANK(w!U23))","v":0},{"$f":"--NOT(ISBLANK(w!V23))","v":1},{"$f":"--NOT(ISBLANK(w!W23))","v":0},{"$f":"--NOT(ISBLANK(w!X23))","v":0},{"$f":"--NOT(ISBLANK(w!Y23))","v":0},{"$f":"--NOT(ISBLANK(w!Z23))","v":0},{"$f":"IF(A23=1,+COUNTIF($A23:A23,1),\"\")","v":""},{"$f":"IF(B23=1,+COUNTIF($A23:B23,1),\"\")","v":1},{"$f":"IF(C23=1,+COUNTIF($A23:C23,1),\"\")","v":""},{"$f":"IF(D23=1,+COUNTIF($A23:D23,1),\"\")","v":""},{"$f":"IF(E23=1,+COUNTIF($A23:E23,1),\"\")","v":""},{"$f":"IF(F23=1,+COUNTIF($A23:F23,1),\"\")","v":""},{"$f":"w!AH23","v":"208"},{"$f":"w!AI23","v":"-"},{"$f":"IFERROR(INDEX($G$1:$L$1,MATCH(COLUMNS($G23:G23),$G23:L23,0)),\"\")","v":"یکشنبه"},{"$f":"IFERROR(INDEX($G$1:$L$1,MATCH(COLUMNS($G23:H23),$G23:L23,0)),\"\")","v":""},{"$f":"IFERROR(INDEX(w!$U23:'w'!$Z23,MATCH(COLUMNS($G23:G23),$G23:L23,0)),\"\")","v":"13-15"},{"$f":"IFERROR(INDEX(w!$U23:'w'!$Z23,MATCH(COLUMNS($G23:H23),$G23:L23,0)),\"\")","v":""},"یکشنبه - 13-15"," - ","208 - یکشنبه - 13-15","- -  - "]
[{"$f":"--NOT(ISBLANK(w!U24))","v":0},{"$f":"--NOT(ISBLANK(w!V24))","v":1},{"$f":"--NOT(ISBLANK(w!W24))","v":0},{"$f":"--NOT(ISBLANK(w!X24))","v":0},{"$f":"--NOT(ISBLANK(w!Y24))","v":0},{"$f":"--NOT(ISBLANK(w!Z24))","v":0},{"$f":"IF(A24=1,+COUNTIF($A24:A24,1),\"\")","v":""},{"$f":"IF(B24=1,+COUNTIF($A24:B24,1),\"\")","v":1},{"$f":"IF(C24=1,+COUNTIF($A24:C24,1),\"\")","v":""},{"$f":"IF(D24=1,+COUNTIF($A24:D24,1),\"\")","v":""},{"$f":"IF(E24=1,+COUNTIF($A24:E24,1),\"\")","v":""},{"$f":"IF(F24=1,+COUNTIF($A24:F24,1),\"\")","v":""},{"$f":"w!AH24","v":"208"},{"$f":"w!AI24","v":"-"},{"$f":"IFERROR(INDEX($G$1:$L$1,MATCH(COLUMNS($G24:G24),$G24:L24,0)),\"\")","v":"یکشنبه"},{"$f":"IFERROR(INDEX($G$1:$L$1,MATCH(COLUMNS($G24:H24),$G24:L24,0)),\"\")","v":""},{"$f":"IFERROR(INDEX(w!$U24:'w'!$Z24,MATCH(COLUMNS($G24:G24),$G24:L24,0)),\"\")","v":"8-10"},{"$f":"IFERROR(INDEX(w!$U24:'w'!$Z24,MATCH(COLUMNS($G24:H24),$G24:L24,0)),\"\")","v":""},"یکشنبه - 8-10"," - ","208 - یکشنبه - 8-10","- -  - "]
[{"$f":"--NOT(ISBLANK(w!U25))","v":0},{"$f":"--NOT(ISBLANK(w!V25))","v":1},{"$f":"--NOT(ISBLANK(w!W25))","v":0},{"$f":"--NOT(ISBLANK(w!X25))","v":0},{"$f":"--NOT(ISBLANK(w!Y25))","v":0},{"$f":"--NOT(ISBLANK(w!Z25))","v":0},{"$f":"IF(A25=1,+COUNTIF($A25:A25,1),\"\")","v":""},{"$f":"IF(B25=1,+COUNTIF($A25:B25,1),\"\")","v":1},{"$f":"IF(C25=1,+COUNTIF($A25:C25,1),\"\")","v":""},{"$f":"IF(D25=1,+COUNTIF($A25:D25,1),\"\")","v":""},{"$f":"IF(E25=1,+COUNTIF($A25:E25,1),\"\")","v":""},{"$f":"IF(F25=1,+COUNTIF($A25:F25,1),\"\")","v":""},{"$f":"w!AH25","v":"208"},{"$f":"w!AI25","v":"-"},{"$f":"IFERROR(INDEX($G$1:$L$1,MATCH(COLUMNS($G25:G25),$G25:L25,0)),\"\")","v":"یکشنبه"},{"$f":"IFERROR(INDEX($G$1:$L$1,MATCH(COLUMNS($G25:H25),$G25:L25,0)),\"\")","v":""},{"$f":"IFERROR(INDEX(w!$U25:'w'!$Z25,MATCH(COLUMNS($G25:G25),$G25:L25,0)),\"\")","v":"10-12"},{"$f":"IFERROR(INDEX(w!$U25:'w'!$Z25,MATCH(COLUMNS($G25:H25),$G25:L25,0)),\"\")","v":""},"یکشنبه - 10-12"," - ","208 - یکشنبه - 10-12","- -  - "]
[{"$f":"--NOT(ISBLANK(w!U26))","v":0},{"$f":"--NOT(ISBLANK(w!V26))","v":0},{"$f":"--NOT(ISBLANK(w!W26))","v":0},{"$f":"--NOT(ISBLANK(w!X26))","v":0},{"$f":"--NOT(ISBLANK(w!Y26))","v":1},{"$f":"--NOT(ISBLANK(w!Z26))","v":0},{"$f":"IF(A26=1,+COUNTIF($A26:A26,1),\"\")","v":""},{"$f":"IF(B26=1,+COUNTIF($A26:B26,1),\"\")","v":""},{"$f":"IF(C26=1,+COUNTIF($A26:C26,1),\"\")","v":""},{"$f":"IF(D26=1,+COUNTIF($A26:D26,1),\"\")","v":""},{"$f":"IF(E26=1,+COUNTIF($A26:E26,1),\"\")","v":1},{"$f":"IF(F26=1,+COUNTIF($A26:F26,1),\"\")","v":""},{"$f":"w!AH26","v":"208"},{"$f":"w!AI26","v":"-"},{"$f":"IFERROR(INDEX($G$1:$L$1,MATCH(COLUMNS($G26:G26),$G26:L26,0)),\"\")","v":"چهارشنبه"},{"$f":"IFERROR(INDEX($G$1:$L$1,MATCH(COLUMNS($G26:H26),$G26:L26,0)),\"\")","v":""},{"$f":"IFERROR(INDEX(w!$U26:'w'!$Z26,MATCH(COLUMNS($G26:G26),$G26:L26,0)),\"\")","v":"8-10"},{"$f":"IFERROR(INDEX(w!$U26:'w'!$Z26,MATCH(COLUMNS($G26:H26),$G26:L26,0)),\"\")","v":""},"چهارشنبه - 8-10"," - ","208 - چهارشنبه - 8-10","- -  - "]
[{"$f":"--NOT(ISBLANK(w!U27))","v":0},{"$f":"--NOT(ISBLANK(w!V27))","v":1},{"$f":"--NOT(ISBLANK(w!W27))","v":0},{"$f":"--NOT(ISBLANK(w!X27))","v":0},{"$f":"--NOT(ISBLANK(w!Y27))","v":0},{"$f":"--NOT(ISBLANK(w!Z27))","v":0},{"$f":"IF(A27=1,+COUNTIF($A27:A27,1),\"\")","v":""},{"$f":"IF(B27=1,+COUNTIF($A27:B27,1),\"\")","v":1},{"$f":"IF(C27=1,+COUNTIF($A27:C27,1),\"\")","v":""},{"$f":"IF(D27=1,+COUNTIF($A27:D27,1),\"\")","v":""},{"$f":"IF(E27=1,+COUNTIF($A27:E27,1),\"\")","v":""},{"$f":"IF(F27=1,+COUNTIF($A27:F27,1),\"\")","v":""},{"$f":"w!AH27","v":"208"},{"$f":"w!AI27","v":"-"},{"$f":"IFERROR(INDEX($G$1:$L$1,MATCH(COLUMNS($G27:G27),$G27:L27,0)),\"\")","v":"یکشنبه"},{"$f":"IFERROR(INDEX($G$1:$L$1,MATCH(COLUMNS($G27:H27),$G27:L27,0)),\"\")","v":""},{"$f":"IFERROR(INDEX(w!$U27:'w'!$Z27,MATCH(COLUMNS($G27:G27),$G27:L27,0)),\"\")","v":"15-17"},{"$f":"IFERROR(INDEX(w!$U27:'w'!$Z27,MATCH(COLUMNS($G27:H27),$G27:L27,0)),\"\")","v":""},"یکشنبه - 15-17"," - ","208 - یکشنبه - 15-17","- -  - "]
[{"$f":"--NOT(ISBLANK(w!U28))","v":0},{"$f":"--NOT(ISBLANK(w!V28))","v":0},{"$f":"--NOT(ISBLANK(w!W28))","v":0},{"$f":"--NOT(ISBLANK(w!X28))","v":1},{"$f":"--NOT(ISBLANK(w!Y28))","v":0},{"$f":"--NOT(ISBLANK(w!Z28))","v":0},{"$f":"IF(A28=1,+COUNTIF($A28:A28,1),\"\")","v":""},{"$f":"IF(B28=1,+COUNTIF($A28:B28,1),\"\")","v":""},{"$f":"IF(C28=1,+COUNTIF($A28:C28,1),\"\")","v":""},{"$f":"IF(D28=1,+COUNTIF($A28:D28,1),\"\")","v":1},{"$f":"IF(E28=1,+COUNTIF($A28:E28,1),\"\")","v":""},{"$f":"IF(F28=1,+COUNTIF($A28:F28,1),\"\")","v":""},{"$f":"w!AH28","v":"213"},{"$f":"w!AI28","v":"-"},{"$f":"IFERROR(INDEX($G$1:$L$1,MATCH(COLUMNS($G28:G28),$G28:L28,0)),\"\")","v":"سه شنبه"},{"$f":"IFERROR(INDEX($G$1:$L$1,MATCH(COLUMNS($G28:H28),$G28:L28,0)),\"\")","v":""},{"$f":"IFERROR(INDEX(w!$U28:'w'!$Z28,MATCH(COLUMNS($G28:G28),$G28:L28,0)),\"\")","v":"10-12"},{"$f":"IFERROR(INDEX(w!$U28:'w'!$Z28,MATCH(COLUMNS($G28:H28),$G28:L28,0)),\"\")","v":""},"سه شنبه - 10-12"," - ","213 - سه شنبه - 10-12","- -  - "]
[{"$f":"--NOT(ISBLANK(w!U29))","v":0},{"$f":"--NOT(ISBLANK(w!V29))","v":0},{"$f":"--NOT(ISBLANK(w!W29))","v":0},{"$f":"--NOT(ISBLANK(w!X29))","v":0},{"$f":"--NOT(ISBLANK(w!Y29))","v":0},{"$f":"--NOT(ISBLANK(w!Z29))","v":0},{"$f":"IF(A29=1,+COUNTIF($A29:A29,1),\"\")","v":""},{"$f":"IF(B29=1,+COUNTIF($A29:B29,1),\"\")","v":""},{"$f":"IF(C29=1,+COUNTIF($A29:C29,1),\"\")","v":""},{"$f":"IF(D29=1,+COUNTIF($A29:D29,1),\"\")","v":""},{"$f":"IF(E29=1,+COUNTIF($A29:E29,1),\"\")","v":""},{"$f":"IF(F29=1,+COUNTIF($A29:F29,1),\"\")","v":""},{"$f":"w!AH29","v":""},{"$f":"w!AI29","v":"-"},{"$f":"IFERROR(INDEX($G$1:$L$1,MATCH(COLUMNS($G29:G29),$G29:L29,0)),\"\")","v":""},{"$f":"IFERROR(INDEX($G$1:$L$1,MATCH(COLUMNS($G29:H29),$G29:L29,0)),\"\")","v":""},{"$f":"IFERROR(INDEX(w!$U29:'w'!$Z29,MATCH(COLUMNS($G29:G29),$G29:L29,0)),\"\")","v":""},{"$f":"IFERROR(INDEX(w!$U29:'w'!$Z29,MATCH(COLUMNS($G29:H29),$G29:L29,0)),\"\")","v":""}," - "," - "," -  - ","- -  - "]
[{"$f":"--NOT(ISBLANK(w!U30))","v":0},{"$f":"--NOT(ISBLANK(w!V30))","v":0},{"$f":"--NOT(ISBLANK(w!W30))","v":0},{"$f":"--NOT(ISBLANK(w!X30))","v":0},{"$f":"--NOT(ISBLANK(w!Y30))","v":0},{"$f":"--NOT(ISBLANK(w!Z30))","v":1},{"$f":"IF(A30=1,+COUNTIF($A30:A30,1),\"\")","v":""},{"$f":"IF(B30=1,+COUNTIF($A30:B30,1),\"\")","v":""},{"$f":"IF(C30=1,+COUNTIF($A30:C30,1),\"\")","v":""},{"$f":"IF(D30=1,+COUNTIF($A30:D30,1),\"\")","v":""},{"$f":"IF(E30=1,+COUNTIF($A30:E30,1),\"\")","v":""},{"$f":"IF(F30=1,+COUNTIF($A30:F30,1),\"\")","v":1},{"$f":"w!AH30","v":"207"},{"$f":"w!AI30","v":"-"},{"$f":"IFERROR(INDEX($G$1:$L$1,MATCH(COLUMNS($G30:G30),$G30:L30,0)),\"\")","v":"پنج شنبه"},{"$f":"IFERROR(INDEX($G$1:$L$1,MATCH(COLUMNS($G30:H30),$G30:L30,0)),\"\")","v":""},{"$f":"IFERROR(INDEX(w!$U30:'w'!$Z30,MATCH(COLUMNS($G30:G30),$G30:L30,0)),\"\")","v":"8-10"},{"$f":"IFERROR(INDEX(w!$U30:'w'!$Z30,MATCH(COLUMNS($G30:H30),$G30:L30,0)),\"\")","v":""},"پنج شنبه - 8-10"," - ","207 - پنج شنبه - 8-10","- -  - "]
[{"$f":"--NOT(ISBLANK(w!U31))","v":0},{"$f":"--NOT(ISBLANK(w!V31))","v":0},{"$f":"--NOT(ISBLANK(w!W31))","v":0},{"$f":"--NOT(ISBLANK(w!X31))","v":0},{"$f":"--NOT(ISBLANK(w!Y31))","v":1},{"$f":"--NOT(ISBLANK(w!Z31))","v":0},{"$f":"IF(A31=1,+COUNTIF($A31:A31,1),\"\")","v":""},{"$f":"IF(B31=1,+COUNTIF($A31:B31,1),\"\")","v":""},{"$f":"IF(C31=1,+COUNTIF($A31:C31,1),\"\")","v":""},{"$f":"IF(D31=1,+COUNTIF($A31:D31,1),\"\")","v":""},{"$f":"IF(E31=1,+COUNTIF($A31:E31,1),\"\")","v":1},{"$f":"IF(F31=1,+COUNTIF($A31:F31,1),\"\")","v":""},{"$f":"w!AH31","v":"208"},{"$f":"w!AI31","v":"-"},{"$f":"IFERROR(INDEX($G$1:$L$1,MATCH(COLUMNS($G31:G31),$G31:L31,0)),\"\")","v":"چهارشنبه"},{"$f":"IFERROR(INDEX($G$1:$L$1,MATCH(COLUMNS($G31:H31),$G31:L31,0)),\"\")","v":""},{"$f":"IFERROR(INDEX(w!$U31:'w'!$Z31,MATCH(COLUMNS($G31:G31),$G31:L31,0)),\"\")","v":"15-17"},{"$f":"IFERROR(INDEX(w!$U31:'w'!$Z31,MATCH(COLUMNS($G31:H31),$G31:L31,0)),\"\")","v":""},"چهارشنبه - 15-17"," - ","208 - چهارشنبه - 15-17","- -  - "]
[{"$f":"--NOT(ISBLANK(w!U32))","v":0},{"$f":"--NOT(ISBLANK(w!V32))","v":0},{"$f":"--NOT(ISBLANK(w!W32))","v":0},{"$f":"--NOT(ISBLANK(w!X32))","v":0},{"$f":"--NOT(ISBLANK(w!Y32))","v":1},{"$f":"--NOT(ISBLANK(w!Z32))","v":0},{"$f":"IF(A32=1,+COUNTIF($A32:A32,1),\"\")","v":""},{"$f":"IF(B32=1,+COUNTIF($A32:B32,1),\"\")","v":""},{"$f":"IF(C32=1,+COUNTIF($A32:C32,1),\"\")","v":""},{"$f":"IF(D32=1,+COUNTIF($A32:D32,1),\"\")","v":""},{"$f":"IF(E32=1,+COUNTIF($A32:E32,1),\"\")","v":1},{"$f":"IF(F32=1,+COUNTIF($A32:F32,1),\"\")","v":""},{"$f":"w!AH32","v":"208"},{"$f":"w!AI32","v":"-"},{"$f":"IFERROR(INDEX($G$1:$L$1,MATCH(COLUMNS($G32:G32),$G32:L32,0)),\"\")","v":"چهارشنبه"},{"$f":"IFERROR(INDEX($G$1:$L$1,MATCH(COLUMNS($G32:H32),$G32:L32,0)),\"\")","v":""},{"$f":"IFERROR(INDEX(w!$U32:'w'!$Z32,MATCH(COLUMNS($G32:G32),$G32:L32,0)),\"\")","v":"13-15"},{"$f":"IFERROR(INDEX(w!$U32:'w'!$Z32,MATCH(COLUMNS($G32:H32),$G32:L32,0)),\"\")","v":""},"چهارشنبه - 13-15"," - ","208 - چهارشنبه - 13-15","- -  - "]
[{"$f":"--NOT(ISBLANK(w!U33))","v":0},{"$f":"--NOT(ISBLANK(w!V33))","v":0},{"$f":"--NOT(ISBLANK(w!W33))","v":1},{"$f":"--NOT(ISBLANK(w!X33))","v":0},{"$f":"--NOT(ISBLANK(w!Y33))","v":0},{"$f":"--NOT(ISBLANK(w!Z33))","v":0},{"$f":"IF(A33=1,+COUNTIF($A33:A33,1),\"\")","v":""},{"$f":"IF(B33=1,+COUNTIF($A33:B33,1),\"\")","v":""},{"$f":"IF(C33=1,+COUNTIF($A33:C33,1),\"\")","v":1},{"$f":"IF(D33=1,+COUNTIF($A33:D33,1),\"\")","v":""},{"$f":"IF(E33=1,+COUNTIF($A33:E33,1),\"\")","v":""},{"$f":"IF(F33=1,+COUNTIF($A33:F33,1),\"\")","v":""},{"$f":"w!AH33","v":"207"},{"$f":"w!AI33","v":"-"},{"$f":"IFERROR(INDEX($G$1:$L$1,MATCH(COLUMNS($G33:G33),$G33:L33,0)),\"\")","v":"دوشنبه"},{"$f":"IFERROR(INDEX($G$1:$L$1,MATCH(COLUMNS($G33:H33),$G33:L33,0)),\"\")","v":""},{"$f":"IFERROR(INDEX(w!$U33:'w'!$Z33,MATCH(COLUMNS($G33:G33),$G33:L33,0)),\"\")","v":"10-12"},{"$f":"IFERROR(INDEX(w!$U33:'w'!$Z33,MATCH(COLUMNS($G33:H33),$G33:L33,0)),\"\")","v":""},"دوشنبه - 10-12"," - ","207 - دوشنبه - 10-12","- -  - "]
[{"$f":"--NOT(ISBLANK(w!U34))","v":0},{"$f":"--NOT(ISBLANK(w!V34))","v":0},{"$f":"--NOT(ISBLANK(w!W34))","v":0},{"$f":"--NOT(ISBLANK(w!X34))","v":0},{"$f":"--NOT(ISBLANK(w!Y34))","v":1},{"$f":"--NOT(ISBLANK(w!Z34))","v":0},{"$f":"IF(A34=1,+COUNTIF($A34:A34,1),\"\")","v":""},{"$f":"IF(B34=1,+COUNTIF($A34:B34,1),\"\")","v":""},{"$f":"IF(C34=1,+COUNTIF($A34:C34,1),\"\")","v":""},{"$f":"IF(D34=1,+COUNTIF($A34:D34,1),\"\")","v":""},{"$f":"IF(E34=1,+COUNTIF($A34:E34,1),\"\")","v":1},{"$f":"IF(F34=1,+COUNTIF($A34:F34,1),\"\")","v":""},{"$f":"w!AH34","v":"209"},{"$f":"w!AI34","v":"-"},{"$f":"IFERROR(INDEX($G$1:$L$1,MATCH(COLUMNS($G34:G34),$G34:L34,0)),\"\")","v":"چهارشنبه"},{"$f":"IFERROR(INDEX($G$1:$L$1,MATCH(COLUMNS($G34:H34),$G34:L34,0)),\"\")","v":""},{"$f":"IFERROR(INDEX(w!$U34:'w'!$Z34,MATCH(COLUMNS($G34:G34),$G34:L34,0)),\"\")","v":"10-12"},{"$f":"IFERROR(INDEX(w!$U34:'w'!$Z34,MATCH(COLUMNS($G34:H34),$G34:L34,0)),\"\")","v":""},{"$f":"CONCATENATE(O34,\" - \",Q34)","v":"چهارشنبه - 10-12"},{"$f":"CONCATENATE(P34,\" - \",R34)","v":" - "},"209 - چهارشنبه - 10-12","- -  - "]
[{"$f":"--NOT(ISBLANK(w!U35))","v":0},{"$f":"--NOT(ISBLANK(w!V35))","v":0},{"$f":"--NOT(ISBLANK(w!W35))","v":1},{"$f":"--NOT(ISBLANK(w!X35))","v":0},{"$f":"--NOT(ISBLANK(w!Y35))","v":0},{"$f":"--NOT(ISBLANK(w!Z35))","v":0},{"$f":"IF(A35=1,+COUNTIF($A35:A35,1),\"\")","v":""},{"$f":"IF(B35=1,+COUNTIF($A35:B35,1),\"\")","v":""},{"$f":"IF(C35=1,+COUNTIF($A35:C35,1),\"\")","v":1},{"$f":"IF(D35=1,+COUNTIF($A35:D35,1),\"\")","v":""},{"$f":"IF(E35=1,+COUNTIF($A35:E35,1),\"\")","v":""},{"$f":"IF(F35=1,+COUNTIF($A35:F35,1),\"\")","v":""},{"$f":"w!AH35","v":"207"},{"$f":"w!AI35","v":"-"},{"$f":"IFERROR(INDEX($G$1:$L$1,MATCH(COLUMNS($G35:G35),$G35:L35,0)),\"\")","v":"دوشنبه"},{"$f":"IFERROR(INDEX($G$1:$L$1,MATCH(COLUMNS($G35:H35),$G35:L35,0)),\"\")","v":""},{"$f":"IFERROR(INDEX(w!$U35:'w'!$Z35,MATCH(COLUMNS($G35:G35),$G35:L35,0)),\"\")","v":"8-10"},{"$f":"IFERROR(INDEX(w!$U35:'w'!$Z35,MATCH(COLUMNS($G35:H35),$G35:L35,0)),\"\")","v":""},"دوشنبه - 8-10"," - ","207 - دوشنبه - 8-10","- -  - "]
[{"$f":"--NOT(ISBLANK(w!U36))","v":0},{"$f":"--NOT(ISBLANK(w!V36))","v":0},{"$f":"--NOT(ISBLANK(w!W36))","v":0},{"$f":"--NOT(ISBLANK(w!X36))","v":0},{"$f":"--NOT(ISBLANK(w!Y36))","v":1},{"$f":"--NOT(ISBLANK(w!Z36))","v":0},{"$f":"IF(A36=1,+COUNTIF($A36:A36,1),\"\")","v":""},{"$f":"IF(B36=1,+COUNTIF($A36:B36,1),\"\")","v":""},{"$f":"IF(C36=1,+COUNTIF($A36:C36,1),\"\")","v":""},{"$f":"IF(D36=1,+COUNTIF($A36:D36,1),\"\")","v":""},{"$f":"IF(E36=1,+COUNTIF($A36:E36,1),\"\")","v":1},{"$f":"IF(F36=1,+COUNTIF($A36:F36,1),\"\")","v":""},{"$f":"w!AH36","v":"209"},{"$f":"w!AI36","v":"-"},{"$f":"IFERROR(INDEX($G$1:$L$1,MATCH(COLUMNS($G36:G36),$G36:L36,0)),\"\")","v":"چهارشنبه"},{"$f":"IFERROR(INDEX($G$1:$L$1,MATCH(COLUMNS($G36:H36),$G36:L36,0)),\"\")","v":""},{"$f":"IFERROR(INDEX(w!$U36:'w'!$Z36,MATCH(COLUMNS($G36:G36),$G36:L36,0)),\"\")","v":"15-17"},{"$f":"IFERROR(INDEX(w!$U36:'w'!$Z36,MATCH(COLUMNS($G36:H36),$G36:L36,0)),\"\")","v":""},"چهارشنبه - 15-17"," - ","209 - چهارشنبه - 15-17","- -  - "]
[{"$f":"--NOT(ISBLANK(w!U37))","v":0},{"$f":"--NOT(ISBLANK(w!V37))","v":0},{"$f":"--NOT(ISBLANK(w!W37))","v":0},{"$f":"--NOT(ISBLANK(w!X37))","v":0},{"$f":"--NOT(ISBLANK(w!Y37))","v":1},{"$f":"--NOT(ISBLANK(w!Z37))","v":0},{"$f":"IF(A37=1,+COUNTIF($A37:A37,1),\"\")","v":""},{"$f":"IF(B37=1,+COUNTIF($A37:B37,1),\"\")","v":""},{"$f":"IF(C37=1,+COUNTIF($A37:C37,1),\"\")","v":""},{"$f":"IF(D37=1,+COUNTIF($A37:D37,1),\"\")","v":""},{"$f":"IF(E37=1,+COUNTIF($A37:E37,1),\"\")","v":1},{"$f":"IF(F37=1,+COUNTIF($A37:F37,1),\"\")","v":""},{"$f":"w!AH37","v":"209"},{"$f":"w!AI37","v":"-"},{"$f":"IFERROR(INDEX($G$1:$L$1,MATCH(COLUMNS($G37:G37),$G37:L37,0)),\"\")","v":"چهارشنبه"},{"$f":"IFERROR(INDEX($G$1:$L$1,MATCH(COLUMNS($G37:H37),$G37:L37,0)),\"\")","v":""},{"$f":"IFERROR(INDEX(w!$U37:'w'!$Z37,MATCH(COLUMNS($G37:G37),$G37:L37,0)),\"\")","v":"8-10"},{"$f":"IFERROR(INDEX(w!$U37:'w'!$Z37,MATCH(COLUMNS($G37:H37),$G37:L37,0)),\"\")","v":""},"چهارشنبه - 8-10"," - ","209 - چهارشنبه - 8-10","- -  - "]
[{"$f":"--NOT(ISBLANK(w!U38))","v":0},{"$f":"--NOT(ISBLANK(w!V38))","v":0},{"$f":"--NOT(ISBLANK(w!W38))","v":0},{"$f":"--NOT(ISBLANK(w!X38))","v":0},{"$f":"--NOT(ISBLANK(w!Y38))","v":0},{"$f":"--NOT(ISBLANK(w!Z38))","v":1},{"$f":"IF(A38=1,+COUNTIF($A38:A38,1),\"\")","v":""},{"$f":"IF(B38=1,+COUNTIF($A38:B38,1),\"\")","v":""},{"$f":"IF(C38=1,+COUNTIF($A38:C38,1),\"\")","v":""},{"$f":"IF(D38=1,+COUNTIF($A38:D38,1),\"\")","v":""},{"$f":"IF(E38=1,+COUNTIF($A38:E38,1),\"\")","v":""},{"$f":"IF(F38=1,+COUNTIF($A38:F38,1),\"\")","v":1},{"$f":"w!AH38","v":"207"},{"$f":"w!AI38","v":"-"},{"$f":"IFERROR(INDEX($G$1:$L$1,MATCH(COLUMNS($G38:G38),$G38:L38,0)),\"\")","v":"پنج شنبه"},{"$f":"IFERROR(INDEX($G$1:$L$1,MATCH(COLUMNS($G38:H38),$G38:L38,0)),\"\")","v":""},{"$f":"IFERROR(INDEX(w!$U38:'w'!$Z38,MATCH(COLUMNS($G38:G38),$G38:L38,0)),\"\")","v":"10-12"},{"$f":"IFERROR(INDEX(w!$U38:'w'!$Z38,MATCH(COLUMNS($G38:H38),$G38:L38,0)),\"\")","v":""},"پنج شنبه - 10-12"," - ","207 - پنج شنبه - 10-12","- -  - "]
[{"$f":"--NOT(ISBLANK(w!U39))","v":0},{"$f":"--NOT(ISBLANK(w!V39))","v":0},{"$f":"--NOT(ISBLANK(w!W39))","v":1},{"$f":"--NOT(ISBLANK(w!X39))","v":0},{"$f":"--NOT(ISBLANK(w!Y39))","v":0},{"$f":"--NOT(ISBLANK(w!Z39))","v":0},{"$f":"IF(A39=1,+COUNTIF($A39:A39,1),\"\")","v":""},{"$f":"IF(B39=1,+COUNTIF($A39:B39,1),\"\")","v":""},{"$f":"IF(C39=1,+COUNTIF($A39:C39,1),\"\")","v":1},{"$f":"IF(D39=1,+COUNTIF($A39:D39,1),\"\")","v":""},{"$f":"IF(E39=1,+COUNTIF($A39:E39,1),\"\")","v":""},{"$f":"IF(F39=1,+COUNTIF($A39:F39,1),\"\")","v":""},{"$f":"w!AH39","v":"207"},{"$f":"w!AI39","v":"-"},{"$f":"IFERROR(INDEX($G$1:$L$1,MATCH(COLUMNS($G39:G39),$G39:L39,0)),\"\")","v":"دوشنبه"},{"$f":"IFERROR(INDEX($G$1:$L$1,MATCH(COLUMNS($G39:H39),$G39:L39,0)),\"\")","v":""},{"$f":"IFERROR(INDEX(w!$U39:'w'!$Z39,MATCH(COLUMNS($G39:G39),$G39:L39,0)),\"\")","v":"15-17"},{"$f":"IFERROR(INDEX(w!$U39:'w'!$Z39,MATCH(COLUMNS($G39:H39),$G39:L39,0)),\"\")","v":""},"دوشنبه - 15-17"," - ","207 - دوشنبه - 15-17","- -  - "]
[{"$f":"--NOT(ISBLANK(w!U40))","v":0},{"$f":"--NOT(ISBLANK(w!V40))","v":0},{"$f":"--NOT(ISBLANK(w!W40))","v":0},{"$f":"--NOT(ISBLANK(w!X40))","v":0},{"$f":"--NOT(ISBLANK(w!Y40))","v":0},{"$f":"--NOT(ISBLANK(w!Z40))","v":0},{"$f":"IF(A40=1,+COUNTIF($A40:A40,1),\"\")","v":""},{"$f":"IF(B40=1,+COUNTIF($A40:B40,1),\"\")","v":""},{"$f":"IF(C40=1,+COUNTIF($A40:C40,1),\"\")","v":""},{"$f":"IF(D40=1,+COUNTIF($A40:D40,1),\"\")","v":""},{"$f":"IF(E40=1,+COUNTIF($A40:E40,1),\"\")","v":""},{"$f":"IF(F40=1,+COUNTIF($A40:F40,1),\"\")","v":""},{"$f":"w!AH40","v":""},{"$f":"w!AI40","v":"-"},{"$f":"IFERROR(INDEX($G$1:$L$1,MATCH(COLUMNS($G40:G40),$G40:L40,0)),\"\")","v":""},{"$f":"IFERROR(INDEX($G$1:$L$1,MATCH(COLUMNS($G40:H40),$G40:L40,0)),\"\")","v":""},{"$f":"IFERROR(INDEX(w!$U40:'w'!$Z40,MATCH(COLUMNS($G40:G40),$G40:L40,0)),\"\")","v":""},{"$f":"IFERROR(INDEX(w!$U40:'w'!$Z40,MATCH(COLUMNS($G40:H40),$G40:L40,0)),\"\")","v":""}," - "," - "," -  - ","- -  - "]
[{"$f":"--NOT(ISBLANK(w!U41))","v":0},{"$f":"--NOT(ISBLANK(w!V41))","v":0},{"$f":"--NOT(ISBLANK(w!W41))","v":0},{"$f":"--NOT(ISBLANK(w!X41))","v":0},{"$f":"--NOT(ISBLANK(w!Y41))","v":0},{"$f":"--NOT(ISBLANK(w!Z41))","v":0},{"$f":"IF(A41=1,+COUNTIF($A41:A41,1),\"\")","v":""},{"$f":"IF(B41=1,+COUNTIF($A41:B41,1),\"\")","v":""},{"$f":"IF(C41=1,+COUNTIF($A41:C41,1),\"\")","v":""},{"$f":"IF(D41=1,+COUNTIF($A41:D41,1),\"\")","v":""},{"$f":"IF(E41=1,+COUNTIF($A41:E41,1),\"\")","v":""},{"$f":"IF(F41=1,+COUNTIF($A41:F41,1),\"\")","v":""},{"$f":"w!AH41","v":""},{"$f":"w!AI41","v":"-"},{"$f":"IFERROR(INDEX($G$1:$L$1,MATCH(COLUMNS($G41:G41),$G41:L41,0)),\"\")","v":""},{"$f":"IFERROR(INDEX($G$1:$L$1,MATCH(COLUMNS($G41:H41),$G41:L41,0)),\"\")","v":""},{"$f":"IFERROR(INDEX(w!$U41:'w'!$Z41,MATCH(COLUMNS($G41:G41),$G41:L41,0)),\"\")","v":""},{"$f":"IFERROR(INDEX(w!$U41:'w'!$Z41,MATCH(COLUMNS($G41:H41),$G41:L41,0)),\"\")","v":""}," - "," - "," -  - ","- -  - "]
[{"$f":"--NOT(ISBLANK(w!U42))","v":1},{"$f":"--NOT(ISBLANK(w!V42))","v":0},{"$f":"--NOT(ISBLANK(w!W42))","v":0},{"$f":"--NOT(ISBLANK(w!X42))","v":0},{"$f":"--NOT(ISBLANK(w!Y42))","v":0},{"$f":"--NOT(ISBLANK(w!Z42))","v":0},{"$f":"IF(A42=1,+COUNTIF($A42:A42,1),\"\")","v":1},{"$f":"IF(B42=1,+COUNTIF($A42:B42,1),\"\")","v":""},{"$f":"IF(C42=1,+COUNTIF($A42:C42,1),\"\")","v":""},{"$f":"IF(D42=1,+COUNTIF($A42:D42,1),\"\")","v":""},{"$f":"IF(E42=1,+COUNTIF($A42:E42,1),\"\")","v":""},{"$f":"IF(F42=1,+COUNTIF($A42:F42,1),\"\")","v":""},{"$f":"w!AH42","v":"210"},{"$f":"w!AI42","v":"-"},{"$f":"IFERROR(INDEX($G$1:$L$1,MATCH(COLUMNS($G42:G42),$G42:L42,0)),\"\")","v":"شنبه"},{"$f":"IFERROR(INDEX($G$1:$L$1,MATCH(COLUMNS($G42:H42),$G42:L42,0)),\"\")","v":""},{"$f":"IFERROR(INDEX(w!$U42:'w'!$Z42,MATCH(COLUMNS($G42:G42),$G42:L42,0)),\"\")","v":"15-17"},{"$f":"IFERROR(INDEX(w!$U42:'w'!$Z42,MATCH(COLUMNS($G42:H42),$G42:L42,0)),\"\")","v":""},"شنبه - 15-17"," - ","210 - شنبه - 15-17","- -  - "]
[{"$f":"--NOT(ISBLANK(w!U43))","v":1},{"$f":"--NOT(ISBLANK(w!V43))","v":0},{"$f":"--NOT(ISBLANK(w!W43))","v":0},{"$f":"--NOT(ISBLANK(w!X43))","v":0},{"$f":"--NOT(ISBLANK(w!Y43))","v":0},{"$f":"--NOT(ISBLANK(w!Z43))","v":0},{"$f":"IF(A43=1,+COUNTIF($A43:A43,1),\"\")","v":1},{"$f":"IF(B43=1,+COUNTIF($A43:B43,1),\"\")","v":""},{"$f":"IF(C43=1,+COUNTIF($A43:C43,1),\"\")","v":""},{"$f":"IF(D43=1,+COUNTIF($A43:D43,1),\"\")","v":""},{"$f":"IF(E43=1,+COUNTIF($A43:E43,1),\"\")","v":""},{"$f":"IF(F43=1,+COUNTIF($A43:F43,1),\"\")","v":""},{"$f":"w!AH43","v":"210"},{"$f":"w!AI43","v":"-"},{"$f":"IFERROR(INDEX($G$1:$L$1,MATCH(COLUMNS($G43:G43),$G43:L43,0)),\"\")","v":"شنبه"},{"$f":"IFERROR(INDEX($G$1:$L$1,MATCH(COLUMNS($G43:H43),$G43:L43,0)),\"\")","v":""},{"$f":"IFERROR(INDEX(w!$U43:'w'!$Z43,MATCH(COLUMNS($G43:G43),$G43:L43,0)),\"\")","v":"13-15"},{"$f":"IFERROR(INDEX(w!$U43:'w'!$Z43,MATCH(COLUMNS($G43:H43),$G43:L43,0)),\"\")","v":""},"شنبه - 13-15"," - ","210 - شنبه - 13-15","- -  - "]
[{"$f":"--NOT(ISBLANK(w!U44))","v":1},{"$f":"--NOT(ISBLANK(w!V44))","v":0},{"$f":"--NOT(ISBLANK(w!W44))","v":0},{"$f":"--NOT(ISBLANK(w!X44))","v":0},{"$f":"--NOT(ISBLANK(w!Y44))","v":0},{"$f":"--NOT(ISBLANK(w!Z44))","v":0},{"$f":"IF(A44=1,+COUNTIF($A44:A44,1),\"\")","v":1},{"$f":"IF(B44=1,+COUNTIF($A44:B44,1),\"\")","v":""},{"$f":"IF(C44=1,+COUNTIF($A44:C44,1),\"\")","v":""},{"$f":"IF(D44=1,+COUNTIF($A44:D44,1),\"\")","v":""},{"$f":"IF(E44=1,+COUNTIF($A44:E44,1),\"\")","v":""},{"$f":"IF(F44=1,+COUNTIF($A44:F44,1),\"\")","v":""},{"$f":"w!AH44","v":"سای"},{"$f":"w!AI44","v":"-"},{"$f":"IFERROR(INDEX($G$1:$L$1,MATCH(COLUMNS($G44:G44),$G44:L44,0)),\"\")","v":"شنبه"},{"$f":"IFERROR(INDEX($G$1:$L$1,MATCH(COLUMNS($G44:H44),$G44:L44,0)),\"\")","v":""},{"$f":"IFERROR(INDEX(w!$U44:'w'!$Z44,MATCH(COLUMNS($G44:G44),$G44:L44,0)),\"\")","v":"10-12"},{"$f":"IFERROR(INDEX(w!$U44:'w'!$Z44,MATCH(COLUMNS($G44:H44),$G44:L44,0)),\"\")","v":""},"شنبه - 10-12"," - ","سای - شنبه - 10-12","- -  - "]
[{"$f":"--NOT(ISBLANK(w!U45))","v":0},{"$f":"--NOT(ISBLANK(w!V45))","v":0},{"$f":"--NOT(ISBLANK(w!W45))","v":0},{"$f":"--NOT(ISBLANK(w!X45))","v":0},{"$f":"--NOT(ISBLANK(w!Y45))","v":1},{"$f":"--NOT(ISBLANK(w!Z45))","v":0},{"$f":"IF(A45=1,+COUNTIF($A45:A45,1),\"\")","v":""},{"$f":"IF(B45=1,+COUNTIF($A45:B45,1),\"\")","v":""},{"$f":"IF(C45=1,+COUNTIF($A45:C45,1),\"\")","v":""},{"$f":"IF(D45=1,+COUNTIF($A45:D45,1),\"\")","v":""},{"$f":"IF(E45=1,+COUNTIF($A45:E45,1),\"\")","v":1},{"$f":"IF(F45=1,+COUNTIF($A45:F45,1),\"\")","v":""},{"$f":"w!AH45","v":"210"},{"$f":"w!AI45","v":"-"},{"$f":"IFERROR(INDEX($G$1:$L$1,MATCH(COLUMNS($G45:G45),$G45:L45,0)),\"\")","v":"چهارشنبه"},{"$f":"IFERROR(INDEX($G$1:$L$1,MATCH(COLUMNS($G45:H45),$G45:L45,0)),\"\")","v":""},{"$f":"IFERROR(INDEX(w!$U45:'w'!$Z45,MATCH(COLUMNS($G45:G45),$G45:L45,0)),\"\")","v":"8-10"},{"$f":"IFERROR(INDEX(w!$U45:'w'!$Z45,MATCH(COLUMNS($G45:H45),$G45:L45,0)),\"\")","v":""},"چهارشنبه - 8-10"," - ","210 - چهارشنبه - 8-10","- -  - "]
[{"$f":"--NOT(ISBLANK(w!U46))","v":0},{"$f":"--NOT(ISBLANK(w!V46))","v":0},{"$f":"--NOT(ISBLANK(w!W46))","v":0},{"$f":"--NOT(ISBLANK(w!X46))","v":0},{"$f":"--NOT(ISBLANK(w!Y46))","v":1},{"$f":"--NOT(ISBLANK(w!Z46))","v":0},{"$f":"IF(A46=1,+COUNTIF($A46:A46,1),\"\")","v":""},{"$f":"IF(B46=1,+COUNTIF($A46:B46,1),\"\")","v":""},{"$f":"IF(C46=1,+COUNTIF($A46:C46,1),\"\")","v":""},{"$f":"IF(D46=1,+COUNTIF($A46:D46,1),\"\")","v":""},{"$f":"IF(E46=1,+COUNTIF($A46:E46,1),\"\")","v":1},{"$f":"IF(F46=1,+COUNTIF($A46:F46,1),\"\")","v":""},{"$f":"w!AH46","v":"210"},{"$f":"w!AI46","v":"-"},{"$f":"IFERROR(INDEX($G$1:$L$1,MATCH(COLUMNS($G46:G46),$G46:L46,0)),\"\")","v":"چهارشنبه"},{"$f":"IFERROR(INDEX($G$1:$L$1,MATCH(COLUMNS($G46:H46),$G46:L46,0)),\"\")","v":""},{"$f":"IFERROR(INDEX(w!$U46:'w'!$Z46,MATCH(COLUMNS($G46:G46),$G46:L46,0)),\"\")","v":"10-12"},{"$f":"IFERROR(INDEX(w!$U46:'w'!$Z46,MATCH(COLUMNS($G46:H46),$G46:L46,0)),\"\")","v":""},"چهارشنبه - 10-12"," - ","210 - چهارشنبه - 10-12","- -  - "]
[{"$f":"--NOT(ISBLANK(w!U47))","v":0},{"$f":"--NOT(ISBLANK(w!V47))","v":0},{"$f":"--NOT(ISBLANK(w!W47))","v":0},{"$f":"--NOT(ISBLANK(w!X47))","v":0},{"$f":"--NOT(ISBLANK(w!Y47))","v":0},{"$f":"--NOT(ISBLANK(w!Z47))","v":0},{"$f":"IF(A47=1,+COUNTIF($A47:A47,1),\"\")","v":""},{"$f":"IF(B47=1,+COUNTIF($A47:B47,1),\"\")","v":""},{"$f":"IF(C47=1,+COUNTIF($A47:C47,1),\"\")","v":""},{"$f":"IF(D47=1,+COUNTIF($A47:D47,1),\"\")","v":""},{"$f":"IF(E47=1,+COUNTIF($A47:E47,1),\"\")","v":""},{"$f":"IF(F47=1,+COUNTIF($A47:F47,1),\"\")","v":""},{"$f":"w!AH47","v":""},{"$f":"w!AI47","v":"-"},{"$f":"IFERROR(INDEX($G$1:$L$1,MATCH(COLUMNS($G47:G47),$G47:L47,0)),\"\")","v":""},{"$f":"IFERROR(INDEX($G$1:$L$1,MATCH(COLUMNS($G47:H47),$G47:L47,0)),\"\")","v":""},{"$f":"IFERROR(INDEX(w!$U47:'w'!$Z47,MATCH(COLUMNS($G47:G47),$G47:L47,0)),\"\")","v":""},{"$f":"IFERROR(INDEX(w!$U47:'w'!$Z47,MATCH(COLUMNS($G47:H47),$G47:L47,0)),\"\")","v":""}," - "," - "," -  - ","- -  - "]
[{"$f":"--NOT(ISBLANK(w!U48))","v":0},{"$f":"--NOT(ISBLANK(w!V48))","v":0},{"$f":"--NOT(ISBLANK(w!W48))","v":0},{"$f":"--NOT(ISBLANK(w!X48))","v":0},{"$f":"--NOT(ISBLANK(w!Y48))","v":1},{"$f":"--NOT(ISBLANK(w!Z48))","v":0},{"$f":"IF(A48=1,+COUNTIF($A48:A48,1),\"\")","v":""},{"$f":"IF(B48=1,+COUNTIF($A48:B48,1),\"\")","v":""},{"$f":"IF(C48=1,+COUNTIF($A48:C48,1),\"\")","v":""},{"$f":"IF(D48=1,+COUNTIF($A48:D48,1),\"\")","v":""},{"$f":"IF(E48=1,+COUNTIF($A48:E48,1),\"\")","v":1},{"$f":"IF(F48=1,+COUNTIF($A48:F48,1),\"\")","v":""},{"$f":"w!AH48","v":"213"},{"$f":"w!AI48","v":"-"},{"$f":"IFERROR(INDEX($G$1:$L$1,MATCH(COLUMNS($G48:G48),$G48:L48,0)),\"\")","v":"چهارشنبه"},{"$f":"IFERROR(INDEX($G$1:$L$1,MATCH(COLUMNS($G48:H48),$G48:L48,0)),\"\")","v":""},{"$f":"IFERROR(INDEX(w!$U48:'w'!$Z48,MATCH(COLUMNS($G48:G48),$G48:L48,0)),\"\")","v":"8-10"},{"$f":"IFERROR(INDEX(w!$U48:'w'!$Z48,MATCH(COLUMNS($G48:H48),$G48:L48,0)),\"\")","v":""},"چهارشنبه - 8-10"," - ","213 - چهارشنبه - 8-10","- -  - "]
[{"$f":"--NOT(ISBLANK(w!U49))","v":0},{"$f":"--NOT(ISBLANK(w!V49))","v":0},{"$f":"--NOT(ISBLANK(w!W49))","v":0},{"$f":"--NOT(ISBLANK(w!X49))","v":0},{"$f":"--NOT(ISBLANK(w!Y49))","v":1},{"$f":"--NOT(ISBLANK(w!Z49))","v":0},{"$f":"IF(A49=1,+COUNTIF($A49:A49,1),\"\")","v":""},{"$f":"IF(B49=1,+COUNTIF($A49:B49,1),\"\")","v":""},{"$f":"IF(C49=1,+COUNTIF($A49:C49,1),\"\")","v":""},{"$f":"IF(D49=1,+COUNTIF($A49:D49,1),\"\")","v":""},{"$f":"IF(E49=1,+COUNTIF($A49:E49,1),\"\")","v":1},{"$f":"IF(F49=1,+COUNTIF($A49:F49,1),\"\")","v":""},{"$f":"w!AH49","v":"209"},{"$f":"w!AI49","v":"-"},{"$f":"IFERROR(INDEX($G$1:$L$1,MATCH(COLUMNS($G49:G49),$G49:L49,0)),\"\")","v":"چهارشنبه"},{"$f":"IFERROR(INDEX($G$1:$L$1,MATCH(COLUMNS($G49:H49),$G49:L49,0)),\"\")","v":""},{"$f":"IFERROR(INDEX(w!$U49:'w'!$Z49,MATCH(COLUMNS($G49:G49),$G49:L49,0)),\"\")","v":"13-15"},{"$f":"IFERROR(INDEX(w!$U49:'w'!$Z49,MATCH(COLUMNS($G49:H49),$G49:L49,0)),\"\")","v":""},"چهارشنبه - 13-15"," - ","209 - چهارشنبه - 13-15","- -  - "]
[{"$f":"--NOT(ISBLANK(w!U50))","v":1},{"$f":"--NOT(ISBLANK(w!V50))","v":0},{"$f":"--NOT(ISBLANK(w!W50))","v":0},{"$f":"--NOT(ISBLANK(w!X50))","v":0},{"$f":"--NOT(ISBLANK(w!Y50))","v":0},{"$f":"--NOT(ISBLANK(w!Z50))","v":0},{"$f":"IF(A50=1,+COUNTIF($A50:A50,1),\"\")","v":1},{"$f":"IF(B50=1,+COUNTIF($A50:B50,1),\"\")","v":""},{"$f":"IF(C50=1,+COUNTIF($A50:C50,1),\"\")","v":""},{"$f":"IF(D50=1,+COUNTIF($A50:D50,1),\"\")","v":""},{"$f":"IF(E50=1,+COUNTIF($A50:E50,1),\"\")","v":""},{"$f":"IF(F50=1,+COUNTIF($A50:F50,1),\"\")","v":""},{"$f":"w!AH50","v":"209"},{"$f":"w!AI50","v":"-"},{"$f":"IFERROR(INDEX($G$1:$L$1,MATCH(COLUMNS($G50:G50),$G50:L50,0)),\"\")","v":"شنبه"},{"$f":"IFERROR(INDEX($G$1:$L$1,MATCH(COLUMNS($G50:H50),$G50:L50,0)),\"\")","v":""},{"$f":"IFERROR(INDEX(w!$U50:'w'!$Z50,MATCH(COLUMNS($G50:G50),$G50:L50,0)),\"\")","v":"8-10"},{"$f":"IFERROR(INDEX(w!$U50:'w'!$Z50,MATCH(COLUMNS($G50:H50),$G50:L50,0)),\"\")","v":""},"شنبه - 8-10"," - ","209 - شنبه - 8-10","- -  - "]
[{"$f":"--NOT(ISBLANK(w!U51))","v":0},{"$f":"--NOT(ISBLANK(w!V51))","v":0},{"$f":"--NOT(ISBLANK(w!W51))","v":0},{"$f":"--NOT(ISBLANK(w!X51))","v":0},{"$f":"--NOT(ISBLANK(w!Y51))","v":1},{"$f":"--NOT(ISBLANK(w!Z51))","v":0},{"$f":"IF(A51=1,+COUNTIF($A51:A51,1),\"\")","v":""},{"$f":"IF(B51=1,+COUNTIF($A51:B51,1),\"\")","v":""},{"$f":"IF(C51=1,+COUNTIF($A51:C51,1),\"\")","v":""},{"$f":"IF(D51=1,+COUNTIF($A51:D51,1),\"\")","v":""},{"$f":"IF(E51=1,+COUNTIF($A51:E51,1),\"\")","v":1},{"$f":"IF(F51=1,+COUNTIF($A51:F51,1),\"\")","v":""},{"$f":"w!AH51","v":"213"},{"$f":"w!AI51","v":"-"},{"$f":"IFERROR(INDEX($G$1:$L$1,MATCH(COLUMNS($G51:G51),$G51:L51,0)),\"\")","v":"چهارشنبه"},{"$f":"IFERROR(INDEX($G$1:$L$1,MATCH(COLUMNS($G51:H51),$G51:L51,0)),\"\")","v":""},{"$f":"IFERROR(INDEX(w!$U51:'w'!$Z51,MATCH(COLUMNS($G51:G51),$G51:L51,0)),\"\")","v":"10-12"},{"$f":"IFERROR(INDEX(w!$U51:'w'!$Z51,MATCH(COLUMNS($G51:H51),$G51:L51,0)),\"\")","v":""},"چهارشنبه - 10-12"," - ","213 - چهارشنبه - 10-12","- -  - "]
[{"$f":"--NOT(ISBLANK(w!U52))","v":1},{"$f":"--NOT(ISBLANK(w!V52))","v":0},{"$f":"--NOT(ISBLANK(w!W52))","v":0},{"$f":"--NOT(ISBLANK(w!X52))","v":0},{"$f":"--NOT(ISBLANK(w!Y52))","v":0},{"$f":"--NOT(ISBLANK(w!Z52))","v":0},{"$f":"IF(A52=1,+COUNTIF($A52:A52,1),\"\")","v":1},{"$f":"IF(B52=1,+COUNTIF($A52:B52,1),\"\")","v":""},{"$f":"IF(C52=1,+COUNTIF($A52:C52,1),\"\")","v":""},{"$f":"IF(D52=1,+COUNTIF($A52:D52,1),\"\")","v":""},{"$f":"IF(E52=1,+COUNTIF($A52:E52,1),\"\")","v":""},{"$f":"IF(F52=1,+COUNTIF($A52:F52,1),\"\")","v":""},{"$f":"w!AH52","v":"آزم"},{"$f":"w!AI52","v":"-"},{"$f":"IFERROR(INDEX($G$1:$L$1,MATCH(COLUMNS($G52:G52),$G52:L52,0)),\"\")","v":"شنبه"},{"$f":"IFERROR(INDEX($G$1:$L$1,MATCH(COLUMNS($G52:H52),$G52:L52,0)),\"\")","v":""},{"$f":"IFERROR(INDEX(w!$U52:'w'!$Z52,MATCH(COLUMNS($G52:G52),$G52:L52,0)),\"\")","v":"15-17"},{"$f":"IFERROR(INDEX(w!$U52:'w'!$Z52,MATCH(COLUMNS($G52:H52),$G52:L52,0)),\"\")","v":""},"شنبه - 15-17"," - ","آزم - شنبه - 15-17","- -  - "]
[{"$f":"--NOT(ISBLANK(w!U53))","v":1},{"$f":"--NOT(ISBLANK(w!V53))","v":0},{"$f":"--NOT(ISBLANK(w!W53))","v":0},{"$f":"--NOT(ISBLANK(w!X53))","v":0},{"$f":"--NOT(ISBLANK(w!Y53))","v":0},{"$f":"--NOT(ISBLANK(w!Z53))","v":0},{"$f":"IF(A53=1,+COUNTIF($A53:A53,1),\"\")","v":1},{"$f":"IF(B53=1,+COUNTIF($A53:B53,1),\"\")","v":""},{"$f":"IF(C53=1,+COUNTIF($A53:C53,1),\"\")","v":""},{"$f":"IF(D53=1,+COUNTIF($A53:D53,1),\"\")","v":""},{"$f":"IF(E53=1,+COUNTIF($A53:E53,1),\"\")","v":""},{"$f":"IF(F53=1,+COUNTIF($A53:F53,1),\"\")","v":""},{"$f":"w!AH53","v":"209"},{"$f":"w!AI53","v":"-"},{"$f":"IFERROR(INDEX($G$1:$L$1,MATCH(COLUMNS($G53:G53),$G53:L53,0)),\"\")","v":"شنبه"},{"$f":"IFERROR(INDEX($G$1:$L$1,MATCH(COLUMNS($G53:H53),$G53:L53,0)),\"\")","v":""},{"$f":"IFERROR(INDEX(w!$U53:'w'!$Z53,MATCH(COLUMNS($G53:G53),$G53:L53,0)),\"\")","v":"8-10"},{"$f":"IFERROR(INDEX(w!$U53:'w'!$Z53,MATCH(COLUMNS($G53:H53),$G53:L53,0)),\"\")","v":""},"شنبه - 8-10"," - ","209 - شنبه - 8-10","- -  - "]
[{"$f":"--NOT(ISBLANK(w!U54))","v":1},{"$f":"--NOT(ISBLANK(w!V54))","v":0},{"$f":"--NOT(ISBLANK(w!W54))","v":0},{"$f":"--NOT(ISBLANK(w!X54))","v":0},{"$f":"--NOT(ISBLANK(w!Y54))","v":0},{"$f":"--NOT(ISBLANK(w!Z54))","v":0},{"$f":"IF(A54=1,+COUNTIF($A54:A54,1),\"\")","v":1},{"$f":"IF(B54=1,+COUNTIF($A54:B54,1),\"\")","v":""},{"$f":"IF(C54=1,+COUNTIF($A54:C54,1),\"\")","v":""},{"$f":"IF(D54=1,+COUNTIF($A54:D54,1),\"\")","v":""},{"$f":"IF(E54=1,+COUNTIF($A54:E54,1),\"\")","v":""},{"$f":"IF(F54=1,+COUNTIF($A54:F54,1),\"\")","v":""},{"$f":"w!AH54","v":"209"},{"$f":"w!AI54","v":"-"},{"$f":"IFERROR(INDEX($G$1:$L$1,MATCH(COLUMNS($G54:G54),$G54:L54,0)),\"\")","v":"شنبه"},{"$f":"IFERROR(INDEX($G$1:$L$1,MATCH(COLUMNS($G54:H54),$G54:L54,0)),\"\")","v":""},{"$f":"IFERROR(INDEX(w!$U54:'w'!$Z54,MATCH(COLUMNS($G54:G54),$G54:L54,0)),\"\")","v":"10-12"},{"$f":"IFERROR(INDEX(w!$U54:'w'!$Z54,MATCH(COLUMNS($G54:H54),$G54:L54,0)),\"\")","v":""},"شنبه - 10-12"," - ","209 - شنبه - 10-12","- -  - "]
[{"$f":"--NOT(ISBLANK(w!U55))","v":1},{"$f":"--NOT(ISBLANK(w!V55))","v":0},{"$f":"--NOT(ISBLANK(w!W55))","v":0},{"$f":"--NOT(ISBLANK(w!X55))","v":0},{"$f":"--NOT(ISBLANK(w!Y55))","v":0},{"$f":"--NOT(ISBLANK(w!Z55))","v":0},{"$f":"IF(A55=1,+COUNTIF($A55:A55,1),\"\")","v":1},{"$f":"IF(B55=1,+COUNTIF($A55:B55,1),\"\")","v":""},{"$f":"IF(C55=1,+COUNTIF($A55:C55,1),\"\")","v":""},{"$f":"IF(D55=1,+COUNTIF($A55:D55,1),\"\")","v":""},{"$f":"IF(E55=1,+COUNTIF($A55:E55,1),\"\")","v":""},{"$f":"IF(F55=1,+COUNTIF($A55:F55,1),\"\")","v":""},{"$f":"w!AH55","v":"213"},{"$f":"w!AI55","v":"-"},{"$f":"IFERROR(INDEX($G$1:$L$1,MATCH(COLUMNS($G55:G55),$G55:L55,0)),\"\")","v":"شنبه"},{"$f":"IFERROR(INDEX($G$1:$L$1,MATCH(COLUMNS($G55:H55),$G55:L55,0)),\"\")","v":""},{"$f":"IFERROR(INDEX(w!$U55:'w'!$Z55,MATCH(COLUMNS($G55:G55),$G55:L55,0)),\"\")","v":"13-15"},{"$f":"IFERROR(INDEX(w!$U55:'w'!$Z55,MATCH(COLUMNS($G55:H55),$G55:L55,0)),\"\")","v":""},"شنبه - 13-15"," - ","213 - شنبه - 13-15","- -  - "]
[{"$f":"--NOT(ISBLANK(w!U56))","v":1},{"$f":"--NOT(ISBLANK(w!V56))","v":0},{"$f":"--NOT(ISBLANK(w!W56))","v":0},{"$f":"--NOT(ISBLANK(w!X56))","v":0},{"$f":"--NOT(ISBLANK(w!Y56))","v":0},{"$f":"--NOT(ISBLANK(w!Z56))","v":0},{"$f":"IF(A56=1,+COUNTIF($A56:A56,1),\"\")","v":1},{"$f":"IF(B56=1,+COUNTIF($A56:B56,1),\"\")","v":""},{"$f":"IF(C56=1,+COUNTIF($A56:C56,1),\"\")","v":""},{"$f":"IF(D56=1,+COUNTIF($A56:D56,1),\"\")","v":""},{"$f":"IF(E56=1,+COUNTIF($A56:E56,1),\"\")","v":""},{"$f":"IF(F56=1,+COUNTIF($A56:F56,1),\"\")","v":""},{"$f":"w!AH56","v":"210"},{"$f":"w!AI56","v":"-"},{"$f":"IFERROR(INDEX($G$1:$L$1,MATCH(COLUMNS($G56:G56),$G56:L56,0)),\"\")","v":"شنبه"},{"$f":"IFERROR(INDEX($G$1:$L$1,MATCH(COLUMNS($G56:H56),$G56:L56,0)),\"\")","v":""},{"$f":"IFERROR(INDEX(w!$U56:'w'!$Z56,MATCH(COLUMNS($G56:G56),$G56:L56,0)),\"\")","v":"8-10"},{"$f":"IFERROR(INDEX(w!$U56:'w'!$Z56,MATCH(COLUMNS($G56:H56),$G56:L56,0)),\"\")","v":""},"شنبه - 8-10"," - ","210 - شنبه - 8-10","- -  - "]
[{"$f":"--NOT(ISBLANK(w!U57))","v":0},{"$f":"--NOT(ISBLANK(w!V57))","v":0},{"$f":"--NOT(ISBLANK(w!W57))","v":1},{"$f":"--NOT(ISBLANK(w!X57))","v":0},{"$f":"--NOT(ISBLANK(w!Y57))","v":0},{"$f":"--NOT(ISBLANK(w!Z57))","v":0},{"$f":"IF(A57=1,+COUNTIF($A57:A57,1),\"\")","v":""},{"$f":"IF(B57=1,+COUNTIF($A57:B57,1),\"\")","v":""},{"$f":"IF(C57=1,+COUNTIF($A57:C57,1),\"\")","v":1},{"$f":"IF(D57=1,+COUNTIF($A57:D57,1),\"\")","v":""},{"$f":"IF(E57=1,+COUNTIF($A57:E57,1),\"\")","v":""},{"$f":"IF(F57=1,+COUNTIF($A57:F57,1),\"\")","v":""},{"$f":"w!AH57","v":"208"},{"$f":"w!AI57","v":"-"},{"$f":"IFERROR(INDEX($G$1:$L$1,MATCH(COLUMNS($G57:G57),$G57:L57,0)),\"\")","v":"دوشنبه"},{"$f":"IFERROR(INDEX($G$1:$L$1,MATCH(COLUMNS($G57:H57),$G57:L57,0)),\"\")","v":""},{"$f":"IFERROR(INDEX(w!$U57:'w'!$Z57,MATCH(COLUMNS($G57:G57),$G57:L57,0)),\"\")","v":"10-12"},{"$f":"IFERROR(INDEX(w!$U57:'w'!$Z57,MATCH(COLUMNS($G57:H57),$G57:L57,0)),\"\")","v":""},"دوشنبه - 10-12"," - ","208 - دوشنبه - 10-12","- -  - "]
[{"$f":"--NOT(ISBLANK(w!U58))","v":0},{"$f":"--NOT(ISBLANK(w!V58))","v":0},{"$f":"--NOT(ISBLANK(w!W58))","v":0},{"$f":"--NOT(ISBLANK(w!X58))","v":0},{"$f":"--NOT(ISBLANK(w!Y58))","v":0},{"$f":"--NOT(ISBLANK(w!Z58))","v":0},{"$f":"IF(A58=1,+COUNTIF($A58:A58,1),\"\")","v":""},{"$f":"IF(B58=1,+COUNTIF($A58:B58,1),\"\")","v":""},{"$f":"IF(C58=1,+COUNTIF($A58:C58,1),\"\")","v":""},{"$f":"IF(D58=1,+COUNTIF($A58:D58,1),\"\")","v":""},{"$f":"IF(E58=1,+COUNTIF($A58:E58,1),\"\")","v":""},{"$f":"IF(F58=1,+COUNTIF($A58:F58,1),\"\")","v":""},{"$f":"w!AH58","v":""},{"$f":"w!AI58","v":"-"},{"$f":"IFERROR(INDEX($G$1:$L$1,MATCH(COLUMNS($G58:G58),$G58:L58,0)),\"\")","v":""},{"$f":"IFERROR(INDEX($G$1:$L$1,MATCH(COLUMNS($G58:H58),$G58:L58,0)),\"\")","v":""},{"$f":"IFERROR(INDEX(w!$U58:'w'!$Z58,MATCH(COLUMNS($G58:G58),$G58:L58,0)),\"\")","v":""},{"$f":"IFERROR(INDEX(w!$U58:'w'!$Z58,MATCH(COLUMNS($G58:H58),$G58:L58,0)),\"\")","v":""}," - "," - "," -  - ","- -  - "]
[{"$f":"--NOT(ISBLANK(w!U59))","v":0},{"$f":"--NOT(ISBLANK(w!V59))","v":0},{"$f":"--NOT(ISBLANK(w!W59))","v":0},{"$f":"--NOT(ISBLANK(w!X59))","v":0},{"$f":"--NOT(ISBLANK(w!Y59))","v":1},{"$f":"--NOT(ISBLANK(w!Z59))","v":0},{"$f":"IF(A59=1,+COUNTIF($A59:A59,1),\"\")","v":""},{"$f":"IF(B59=1,+COUNTIF($A59:B59,1),\"\")","v":""},{"$f":"IF(C59=1,+COUNTIF($A59:C59,1),\"\")","v":""},{"$f":"IF(D59=1,+COUNTIF($A59:D59,1),\"\")","v":""},{"$f":"IF(E59=1,+COUNTIF($A59:E59,1),\"\")","v":1},{"$f":"IF(F59=1,+COUNTIF($A59:F59,1),\"\")","v":""},{"$f":"w!AH59","v":"213"},{"$f":"w!AI59","v":"-"},{"$f":"IFERROR(INDEX($G$1:$L$1,MATCH(COLUMNS($G59:G59),$G59:L59,0)),\"\")","v":"چهارشنبه"},{"$f":"IFERROR(INDEX($G$1:$L$1,MATCH(COLUMNS($G59:H59),$G59:L59,0)),\"\")","v":""},{"$f":"IFERROR(INDEX(w!$U59:'w'!$Z59,MATCH(COLUMNS($G59:G59),$G59:L59,0)),\"\")","v":"13-16"},{"$f":"IFERROR(INDEX(w!$U59:'w'!$Z59,MATCH(COLUMNS($G59:H59),$G59:L59,0)),\"\")","v":""},"چهارشنبه - 13-16"," - ","213 - چهارشنبه - 13-16","- -  - "]
[{"$f":"--NOT(ISBLANK(w!U60))","v":0},{"$f":"--NOT(ISBLANK(w!V60))","v":1},{"$f":"--NOT(ISBLANK(w!W60))","v":0},{"$f":"--NOT(ISBLANK(w!X60))","v":1},{"$f":"--NOT(ISBLANK(w!Y60))","v":0},{"$f":"--NOT(ISBLANK(w!Z60))","v":0},{"$f":"IF(A60=1,+COUNTIF($A60:A60,1),\"\")","v":""},{"$f":"IF(B60=1,+COUNTIF($A60:B60,1),\"\")","v":1},{"$f":"IF(C60=1,+COUNTIF($A60:C60,1),\"\")","v":""},{"$f":"IF(D60=1,+COUNTIF($A60:D60,1),\"\")","v":2},{"$f":"IF(E60=1,+COUNTIF($A60:E60,1),\"\")","v":""},{"$f":"IF(F60=1,+COUNTIF($A60:F60,1),\"\")","v":""},{"$f":"w!AH60","v":"209"},{"$f":"w!AI60","v":"209"},{"$f":"IFERROR(INDEX($G$1:$L$1,MATCH(COLUMNS($G60:G60),$G60:L60,0)),\"\")","v":"یکشنبه"},{"$f":"IFERROR(INDEX($G$1:$L$1,MATCH(COLUMNS($G60:H60),$G60:L60,0)),\"\")","v":"سه شنبه"},{"$f":"IFERROR(INDEX(w!$U60:'w'!$Z60,MATCH(COLUMNS($G60:G60),$G60:L60,0)),\"\")","v":"15-17"},{"$f":"IFERROR(INDEX(w!$U60:'w'!$Z60,MATCH(COLUMNS($G60:H60),$G60:L60,0)),\"\")","v":"13-15"},"یکشنبه - 15-17","سه شنبه - 13-15","209 - یکشنبه - 15-17","209 - سه شنبه - 13-15"]
[{"$f":"--NOT(ISBLANK(w!U61))","v":0},{"$f":"--NOT(ISBLANK(w!V61))","v":0},{"$f":"--NOT(ISBLANK(w!W61))","v":0},{"$f":"--NOT(ISBLANK(w!X61))","v":0},{"$f":"--NOT(ISBLANK(w!Y61))","v":1},{"$f":"--NOT(ISBLANK(w!Z61))","v":0},{"$f":"IF(A61=1,+COUNTIF($A61:A61,1),\"\")","v":""},{"$f":"IF(B61=1,+COUNTIF($A61:B61,1),\"\")","v":""},{"$f":"IF(C61=1,+COUNTIF($A61:C61,1),\"\")","v":""},{"$f":"IF(D61=1,+COUNTIF($A61:D61,1),\"\")","v":""},{"$f":"IF(E61=1,+COUNTIF($A61:E61,1),\"\")","v":1},{"$f":"IF(F61=1,+COUNTIF($A61:F61,1),\"\")","v":""},{"$f":"w!AH61","v":"210"},{"$f":"w!AI61","v":"-"},{"$f":"IFERROR(INDEX($G$1:$L$1,MATCH(COLUMNS($G61:G61),$G61:L61,0)),\"\")","v":"چهارشنبه"},{"$f":"IFERROR(INDEX($G$1:$L$1,MATCH(COLUMNS($G61:H61),$G61:L61,0)),\"\")","v":""},{"$f":"IFERROR(INDEX(w!$U61:'w'!$Z61,MATCH(COLUMNS($G61:G61),$G61:L61,0)),\"\")","v":"16-19"},{"$f":"IFERROR(INDEX(w!$U61:'w'!$Z61,MATCH(COLUMNS($G61:H61),$G61:L61,0)),\"\")","v":""},"چهارشنبه - 16-19"," - ","210 - چهارشنبه - 16-19","- -  - "]
[{"$f":"--NOT(ISBLANK(w!U62))","v":0},{"$f":"--NOT(ISBLANK(w!V62))","v":1},{"$f":"--NOT(ISBLANK(w!W62))","v":0},{"$f":"--NOT(ISBLANK(w!X62))","v":1},{"$f":"--NOT(ISBLANK(w!Y62))","v":0},{"$f":"--NOT(ISBLANK(w!Z62))","v":0},{"$f":"IF(A62=1,+COUNTIF($A62:A62,1),\"\")","v":""},{"$f":"IF(B62=1,+COUNTIF($A62:B62,1),\"\")","v":1},{"$f":"IF(C62=1,+COUNTIF($A62:C62,1),\"\")","v":""},{"$f":"IF(D62=1,+COUNTIF($A62:D62,1),\"\")","v":2},{"$f":"IF(E62=1,+COUNTIF($A62:E62,1),\"\")","v":""},{"$f":"IF(F62=1,+COUNTIF($A62:F62,1),\"\")","v":""},{"$f":"w!AH62","v":"209"},{"$f":"w!AI62","v":"209"},{"$f":"IFERROR(INDEX($G$1:$L$1,MATCH(COLUMNS($G62:G62),$G62:L62,0)),\"\")","v":"یکشنبه"},{"$f":"IFERROR(INDEX($G$1:$L$1,MATCH(COLUMNS($G62:H62),$G62:L62,0)),\"\")","v":"سه شنبه"},{"$f":"IFERROR(INDEX(w!$U62:'w'!$Z62,MATCH(COLUMNS($G62:G62),$G62:L62,0)),\"\")","v":"10-12"},{"$f":"IFERROR(INDEX(w!$U62:'w'!$Z62,MATCH(COLUMNS($G62:H62),$G62:L62,0)),\"\")","v":"10-12"},"یکشنبه - 10-12","سه شنبه - 10-12","209 - یکشنبه - 10-12","209 - سه شنبه - 10-12"]
[{"$f":"--NOT(ISBLANK(w!U63))","v":0},{"$f":"--NOT(ISBLANK(w!V63))","v":0},{"$f":"--NOT(ISBLANK(w!W63))","v":0},{"$f":"--NOT(ISBLANK(w!X63))","v":0},{"$f":"--NOT(ISBLANK(w!Y63))","v":1},{"$f":"--NOT(ISBLANK(w!Z63))","v":0},{"$f":"IF(A63=1,+COUNTIF($A63:A63,1),\"\")","v":""},{"$f":"IF(B63=1,+COUNTIF($A63:B63,1),\"\")","v":""},{"$f":"IF(C63=1,+COUNTIF($A63:C63,1),\"\")","v":""},{"$f":"IF(D63=1,+COUNTIF($A63:D63,1),\"\")","v":""},{"$f":"IF(E63=1,+COUNTIF($A63:E63,1),\"\")","v":1},{"$f":"IF(F63=1,+COUNTIF($A63:F63,1),\"\")","v":""},{"$f":"w!AH63","v":""},{"$f":"w!AI63","v":"-"},{"$f":"IFERROR(INDEX($G$1:$L$1,MATCH(COLUMNS($G63:G63),$G63:L63,0)),\"\")","v":"چهارشنبه"},{"$f":"IFERROR(INDEX($G$1:$L$1,MATCH(COLUMNS($G63:H63),$G63:L63,0)),\"\")","v":""},{"$f":"IFERROR(INDEX(w!$U63:'w'!$Z63,MATCH(COLUMNS($G63:G63),$G63:L63,0)),\"\")","v":"10-13"},{"$f":"IFERROR(INDEX(w!$U63:'w'!$Z63,MATCH(COLUMNS($G63:H63),$G63:L63,0)),\"\")","v":""},"چهارشنبه - 10-13"," - "," - چهارشنبه - 10-13","- -  - "]
[{"$f":"--NOT(ISBLANK(w!U64))","v":0},{"$f":"--NOT(ISBLANK(w!V64))","v":1},{"$f":"--NOT(ISBLANK(w!W64))","v":0},{"$f":"--NOT(ISBLANK(w!X64))","v":1},{"$f":"--NOT(ISBLANK(w!Y64))","v":0},{"$f":"--NOT(ISBLANK(w!Z64))","v":0},{"$f":"IF(A64=1,+COUNTIF($A64:A64,1),\"\")","v":""},{"$f":"IF(B64=1,+COUNTIF($A64:B64,1),\"\")","v":1},{"$f":"IF(C64=1,+COUNTIF($A64:C64,1),\"\")","v":""},{"$f":"IF(D64=1,+COUNTIF($A64:D64,1),\"\")","v":2},{"$f":"IF(E64=1,+COUNTIF($A64:E64,1),\"\")","v":""},{"$f":"IF(F64=1,+COUNTIF($A64:F64,1),\"\")","v":""},{"$f":"w!AH64","v":"209"},{"$f":"w!AI64","v":"209"},{"$f":"IFERROR(INDEX($G$1:$L$1,MATCH(COLUMNS($G64:G64),$G64:L64,0)),\"\")","v":"یکشنبه"},{"$f":"IFERROR(INDEX($G$1:$L$1,MATCH(COLUMNS($G64:H64),$G64:L64,0)),\"\")","v":"سه شنبه"},{"$f":"IFERROR(INDEX(w!$U64:'w'!$Z64,MATCH(COLUMNS($G64:G64),$G64:L64,0)),\"\")","v":"13-15"},{"$f":"IFERROR(INDEX(w!$U64:'w'!$Z64,MATCH(COLUMNS($G64:H64),$G64:L64,0)),\"\")","v":"15-17"},{"$f":"CONCATENATE(O64,\" - \",Q64)","v":"یکشنبه - 13-15"},{"$f":"CONCATENATE(P64,\" - \",R64)","v":"سه شنبه - 15-17"},{"$f":"CONCATENATE(M64,\" - \",O64,\" - \",Q64)","v":"209 - یکشنبه - 13-15"},{"$f":"CONCATENATE(N64,\" - \",P64,\" - \",R64)","v":"209 - سه شنبه - 15-17"}]
[{"$f":"--NOT(ISBLANK(w!U65))","v":0},{"$f":"--NOT(ISBLANK(w!V65))","v":1},{"$f":"--NOT(ISBLANK(w!W65))","v":0},{"$f":"--NOT(ISBLANK(w!X65))","v":0},{"$f":"--NOT(ISBLANK(w!Y65))","v":0},{"$f":"--NOT(ISBLANK(w!Z65))","v":0},{"$f":"IF(A65=1,+COUNTIF($A65:A65,1),\"\")","v":""},{"$f":"IF(B65=1,+COUNTIF($A65:B65,1),\"\")","v":1},{"$f":"IF(C65=1,+COUNTIF($A65:C65,1),\"\")","v":""},{"$f":"IF(D65=1,+COUNTIF($A65:D65,1),\"\")","v":""},{"$f":"IF(E65=1,+COUNTIF($A65:E65,1),\"\")","v":""},{"$f":"IF(F65=1,+COUNTIF($A65:F65,1),\"\")","v":""},{"$f":"w!AH65","v":"213"},{"$f":"w!AI65","v":"-"},{"$f":"IFERROR(INDEX($G$1:$L$1,MATCH(COLUMNS($G65:G65),$G65:L65,0)),\"\")","v":"یکشنبه"},{"$f":"IFERROR(INDEX($G$1:$L$1,MATCH(COLUMNS($G65:H65),$G65:L65,0)),\"\")","v":""},{"$f":"IFERROR(INDEX(w!$U65:'w'!$Z65,MATCH(COLUMNS($G65:G65),$G65:L65,0)),\"\")","v":"7-10"},{"$f":"IFERROR(INDEX(w!$U65:'w'!$Z65,MATCH(COLUMNS($G65:H65),$G65:L65,0)),\"\")","v":""},"یکشنبه - 7-10"," - ","213 - یکشنبه - 7-10","- -  - "]
[{"$f":"--NOT(ISBLANK(w!U66))","v":0},{"$f":"--NOT(ISBLANK(w!V66))","v":0},{"$f":"--NOT(ISBLANK(w!W66))","v":0},{"$f":"--NOT(ISBLANK(w!X66))","v":0},{"$f":"--NOT(ISBLANK(w!Y66))","v":1},{"$f":"--NOT(ISBLANK(w!Z66))","v":0},{"$f":"IF(A66=1,+COUNTIF($A66:A66,1),\"\")","v":""},{"$f":"IF(B66=1,+COUNTIF($A66:B66,1),\"\")","v":""},{"$f":"IF(C66=1,+COUNTIF($A66:C66,1),\"\")","v":""},{"$f":"IF(D66=1,+COUNTIF($A66:D66,1),\"\")","v":""},{"$f":"IF(E66=1,+COUNTIF($A66:E66,1),\"\")","v":1},{"$f":"IF(F66=1,+COUNTIF($A66:F66,1),\"\")","v":""},{"$f":"w!AH66","v":"209"},{"$f":"w!AI66","v":"-"},{"$f":"IFERROR(INDEX($G$1:$L$1,MATCH(COLUMNS($G66:G66),$G66:L66,0)),\"\")","v":"چهارشنبه"},{"$f":"IFERROR(INDEX($G$1:$L$1,MATCH(COLUMNS($G66:H66),$G66:L66,0)),\"\")","v":""},{"$f":"IFERROR(INDEX(w!$U66:'w'!$Z66,MATCH(COLUMNS($G66:G66),$G66:L66,0)),\"\")","v":"7-10"},{"$f":"IFERROR(INDEX(w!$U66:'w'!$Z66,MATCH(COLUMNS($G66:H66),$G66:L66,0)),\"\")","v":""},"چهارشنبه - 7-10"," - ","209 - چهارشنبه - 7-10","- -  - "]
[{"$f":"--NOT(ISBLANK(w!U67))","v":0},{"$f":"--NOT(ISBLANK(w!V67))","v":1},{"$f":"--NOT(ISBLANK(w!W67))","v":0},{"$f":"--NOT(ISBLANK(w!X67))","v":1},{"$f":"--NOT(ISBLANK(w!Y67))","v":0},{"$f":"--NOT(ISBLANK(w!Z67))","v":0},{"$f":"IF(A67=1,+COUNTIF($A67:A67,1),\"\")","v":""},{"$f":"IF(B67=1,+COUNTIF($A67:B67,1),\"\")","v":1},{"$f":"IF(C67=1,+COUNTIF($A67:C67,1),\"\")","v":""},{"$f":"IF(D67=1,+COUNTIF($A67:D67,1),\"\")","v":2},{"$f":"IF(E67=1,+COUNTIF($A67:E67,1),\"\")","v":""},{"$f":"IF(F67=1,+COUNTIF($A67:F67,1),\"\")","v":""},{"$f":"w!AH67","v":"209"},{"$f":"w!AI67","v":"209"},{"$f":"IFERROR(INDEX($G$1:$L$1,MATCH(COLUMNS($G67:G67),$G67:L67,0)),\"\")","v":"یکشنبه"},{"$f":"IFERROR(INDEX($G$1:$L$1,MATCH(COLUMNS($G67:H67),$G67:L67,0)),\"\")","v":"سه شنبه"},{"$f":"IFERROR(INDEX(w!$U67:'w'!$Z67,MATCH(COLUMNS($G67:G67),$G67:L67,0)),\"\")","v":"8-10"},{"$f":"IFERROR(INDEX(w!$U67:'w'!$Z67,MATCH(COLUMNS($G67:H67),$G67:L67,0)),\"\")","v":"8-10"},"یکشنبه - 8-10","سه شنبه - 8-10","209 - یکشنبه - 8-10","209 - سه شنبه - 8-10"]
[{"$f":"--NOT(ISBLANK(w!U68))","v":0},{"$f":"--NOT(ISBLANK(w!V68))","v":0},{"$f":"--NOT(ISBLANK(w!W68))","v":0},{"$f":"--NOT(ISBLANK(w!X68))","v":1},{"$f":"--NOT(ISBLANK(w!Y68))","v":0},{"$f":"--NOT(ISBLANK(w!Z68))","v":0},{"$f":"IF(A68=1,+COUNTIF($A68:A68,1),\"\")","v":""},{"$f":"IF(B68=1,+COUNTIF($A68:B68,1),\"\")","v":""},{"$f":"IF(C68=1,+COUNTIF($A68:C68,1),\"\")","v":""},{"$f":"IF(D68=1,+COUNTIF($A68:D68,1),\"\")","v":1},{"$f":"IF(E68=1,+COUNTIF($A68:E68,1),\"\")","v":""},{"$f":"IF(F68=1,+COUNTIF($A68:F68,1),\"\")","v":""},{"$f":"w!AH68","v":"210"},{"$f":"w!AI68","v":"-"},{"$f":"IFERROR(INDEX($G$1:$L$1,MATCH(COLUMNS($G68:G68),$G68:L68,0)),\"\")","v":"سه شنبه"},{"$f":"IFERROR(INDEX($G$1:$L$1,MATCH(COLUMNS($G68:H68),$G68:L68,0)),\"\")","v":""},{"$f":"IFERROR(INDEX(w!$U68:'w'!$Z68,MATCH(COLUMNS($G68:G68),$G68:L68,0)),\"\")","v":"15-18"},{"$f":"IFERROR(INDEX(w!$U68:'w'!$Z68,MATCH(COLUMNS($G68:H68),$G68:L68,0)),\"\")","v":""},"سه شنبه - 15-18"," - ","210 - سه شنبه - 15-18","- -  - "]
[{"$f":"--NOT(ISBLANK(w!U69))","v":0},{"$f":"--NOT(ISBLANK(w!V69))","v":1},{"$f":"--NOT(ISBLANK(w!W69))","v":0},{"$f":"--NOT(ISBLANK(w!X69))","v":1},{"$f":"--NOT(ISBLANK(w!Y69))","v":0},{"$f":"--NOT(ISBLANK(w!Z69))","v":0},{"$f":"IF(A69=1,+COUNTIF($A69:A69,1),\"\")","v":""},{"$f":"IF(B69=1,+COUNTIF($A69:B69,1),\"\")","v":1},{"$f":"IF(C69=1,+COUNTIF($A69:C69,1),\"\")","v":""},{"$f":"IF(D69=1,+COUNTIF($A69:D69,1),\"\")","v":2},{"$f":"IF(E69=1,+COUNTIF($A69:E69,1),\"\")","v":""},{"$f":"IF(F69=1,+COUNTIF($A69:F69,1),\"\")","v":""},{"$f":"w!AH69","v":"210"},{"$f":"w!AI69","v":"210"},{"$f":"IFERROR(INDEX($G$1:$L$1,MATCH(COLUMNS($G69:G69),$G69:L69,0)),\"\")","v":"یکشنبه"},{"$f":"IFERROR(INDEX($G$1:$L$1,MATCH(COLUMNS($G69:H69),$G69:L69,0)),\"\")","v":"سه شنبه"},{"$f":"IFERROR(INDEX(w!$U69:'w'!$Z69,MATCH(COLUMNS($G69:G69),$G69:L69,0)),\"\")","v":"15-17"},{"$f":"IFERROR(INDEX(w!$U69:'w'!$Z69,MATCH(COLUMNS($G69:H69),$G69:L69,0)),\"\")","v":"13-15"},"یکشنبه - 15-17","سه شنبه - 13-15","210 - یکشنبه - 15-17","210 - سه شنبه - 13-15"]
[{"$f":"--NOT(ISBLANK(w!U70))","v":0},{"$f":"--NOT(ISBLANK(w!V70))","v":0},{"$f":"--NOT(ISBLANK(w!W70))","v":0},{"$f":"--NOT(ISBLANK(w!X70))","v":0},{"$f":"--NOT(ISBLANK(w!Y70))","v":0},{"$f":"--NOT(ISBLANK(w!Z70))","v":1},{"$f":"IF(A70=1,+COUNTIF($A70:A70,1),\"\")","v":""},{"$f":"IF(B70=1,+COUNTIF($A70:B70,1),\"\")","v":""},{"$f":"IF(C70=1,+COUNTIF($A70:C70,1),\"\")","v":""},{"$f":"IF(D70=1,+COUNTIF($A70:D70,1),\"\")","v":""},{"$f":"IF(E70=1,+COUNTIF($A70:E70,1),\"\")","v":""},{"$f":"IF(F70=1,+COUNTIF($A70:F70,1),\"\")","v":1},{"$f":"w!AH70","v":"208"},{"$f":"w!AI70","v":"-"},{"$f":"IFERROR(INDEX($G$1:$L$1,MATCH(COLUMNS($G70:G70),$G70:L70,0)),\"\")","v":"پنج شنبه"},{"$f":"IFERROR(INDEX($G$1:$L$1,MATCH(COLUMNS($G70:H70),$G70:L70,0)),\"\")","v":""},{"$f":"IFERROR(INDEX(w!$U70:'w'!$Z70,MATCH(COLUMNS($G70:G70),$G70:L70,0)),\"\")","v":"10-13"},{"$f":"IFERROR(INDEX(w!$U70:'w'!$Z70,MATCH(COLUMNS($G70:H70),$G70:L70,0)),\"\")","v":""},"پنج شنبه - 10-13"," - ","208 - پنج شنبه - 10-13","- -  - "]
[{"$f":"--NOT(ISBLANK(w!U71))","v":0},{"$f":"--NOT(ISBLANK(w!V71))","v":1},{"$f":"--NOT(ISBLANK(w!W71))","v":0},{"$f":"--NOT(ISBLANK(w!X71))","v":0},{"$f":"--NOT(ISBLANK(w!Y71))","v":0},{"$f":"--NOT(ISBLANK(w!Z71))","v":0},{"$f":"IF(A71=1,+COUNTIF($A71:A71,1),\"\")","v":""},{"$f":"IF(B71=1,+COUNTIF($A71:B71,1),\"\")","v":1},{"$f":"IF(C71=1,+COUNTIF($A71:C71,1),\"\")","v":""},{"$f":"IF(D71=1,+COUNTIF($A71:D71,1),\"\")","v":""},{"$f":"IF(E71=1,+COUNTIF($A71:E71,1),\"\")","v":""},{"$f":"IF(F71=1,+COUNTIF($A71:F71,1),\"\")","v":""},{"$f":"w!AH71","v":"210"},{"$f":"w!AI71","v":"-"},{"$f":"IFERROR(INDEX($G$1:$L$1,MATCH(COLUMNS($G71:G71),$G71:L71,0)),\"\")","v":"یکشنبه"},{"$f":"IFERROR(INDEX($G$1:$L$1,MATCH(COLUMNS($G71:H71),$G71:L71,0)),\"\")","v":""},{"$f":"IFERROR(INDEX(w!$U71:'w'!$Z71,MATCH(COLUMNS($G71:G71),$G71:L71,0)),\"\")","v":"10-13"},{"$f":"IFERROR(INDEX(w!$U71:'w'!$Z71,MATCH(COLUMNS($G71:H71),$G71:L71,0)),\"\")","v":""},"یکشنبه - 10-13"," - ","210 - یکشنبه - 10-13","- -  - "]
[{"$f":"--NOT(ISBLANK(w!U72))","v":0},{"$f":"--NOT(ISBLANK(w!V72))","v":0},{"$f":"--NOT(ISBLANK(w!W72))","v":0},{"$f":"--NOT(ISBLANK(w!X72))","v":0},{"$f":"--NOT(ISBLANK(w!Y72))","v":0},{"$f":"--NOT(ISBLANK(w!Z72))","v":1},{"$f":"IF(A72=1,+COUNTIF($A72:A72,1),\"\")","v":""},{"$f":"IF(B72=1,+COUNTIF($A72:B72,1),\"\")","v":""},{"$f":"IF(C72=1,+COUNTIF($A72:C72,1),\"\")","v":""},{"$f":"IF(D72=1,+COUNTIF($A72:D72,1),\"\")","v":""},{"$f":"IF(E72=1,+COUNTIF($A72:E72,1),\"\")","v":""},{"$f":"IF(F72=1,+COUNTIF($A72:F72,1),\"\")","v":1},{"$f":"w!AH72","v":"207"},{"$f":"w!AI72","v":"-"},{"$f":"IFERROR(INDEX($G$1:$L$1,MATCH(COLUMNS($G72:G72),$G72:L72,0)),\"\")","v":"پنج شنبه"},{"$f":"IFERROR(INDEX($G$1:$L$1,MATCH(COLUMNS($G72:H72),$G72:L72,0)),\"\")","v":""},{"$f":"IFERROR(INDEX(w!$U72:'w'!$Z72,MATCH(COLUMNS($G72:G72),$G72:L72,0)),\"\")","v":"14-17"},{"$f":"IFERROR(INDEX(w!$U72:'w'!$Z72,MATCH(COLUMNS($G72:H72),$G72:L72,0)),\"\")","v":""},"پنج شنبه - 14-17"," - ","207 - پنج شنبه - 14-17","- -  - "]
[{"$f":"--NOT(ISBLANK(w!U73))","v":0},{"$f":"--NOT(ISBLANK(w!V73))","v":1},{"$f":"--NOT(ISBLANK(w!W73))","v":0},{"$f":"--NOT(ISBLANK(w!X73))","v":0},{"$f":"--NOT(ISBLANK(w!Y73))","v":0},{"$f":"--NOT(ISBLANK(w!Z73))","v":0},{"$f":"IF(A73=1,+COUNTIF($A73:A73,1),\"\")","v":""},{"$f":"IF(B73=1,+COUNTIF($A73:B73,1),\"\")","v":1},{"$f":"IF(C73=1,+COUNTIF($A73:C73,1),\"\")","v":""},{"$f":"IF(D73=1,+COUNTIF($A73:D73,1),\"\")","v":""},{"$f":"IF(E73=1,+COUNTIF($A73:E73,1),\"\")","v":""},{"$f":"IF(F73=1,+COUNTIF($A73:F73,1),\"\")","v":""},{"$f":"w!AH73","v":"213"},{"$f":"w!AI73","v":"-"},{"$f":"IFERROR(INDEX($G$1:$L$1,MATCH(COLUMNS($G73:G73),$G73:L73,0)),\"\")","v":"یکشنبه"},{"$f":"IFERROR(INDEX($G$1:$L$1,MATCH(COLUMNS($G73:H73),$G73:L73,0)),\"\")","v":""},{"$f":"IFERROR(INDEX(w!$U73:'w'!$Z73,MATCH(COLUMNS($G73:G73),$G73:L73,0)),\"\")","v":"7-10"},{"$f":"IFERROR(INDEX(w!$U73:'w'!$Z73,MATCH(COLUMNS($G73:H73),$G73:L73,0)),\"\")","v":""},"یکشنبه - 7-10"," - ","213 - یکشنبه - 7-10","- -  - "]
[{"$f":"--NOT(ISBLANK(w!U74))","v":0},{"$f":"--NOT(ISBLANK(w!V74))","v":0},{"$f":"--NOT(ISBLANK(w!W74))","v":0},{"$f":"--NOT(ISBLANK(w!X74))","v":0},{"$f":"--NOT(ISBLANK(w!Y74))","v":0},{"$f":"--NOT(ISBLANK(w!Z74))","v":1},{"$f":"IF(A74=1,+COUNTIF($A74:A74,1),\"\")","v":""},{"$f":"IF(B74=1,+COUNTIF($A74:B74,1),\"\")","v":""},{"$f":"IF(C74=1,+COUNTIF($A74:C74,1),\"\")","v":""},{"$f":"IF(D74=1,+COUNTIF($A74:D74,1),\"\")","v":""},{"$f":"IF(E74=1,+COUNTIF($A74:E74,1),\"\")","v":""},{"$f":"IF(F74=1,+COUNTIF($A74:F74,1),\"\")","v":1},{"$f":"w!AH74","v":"208"},{"$f":"w!AI74","v":"-"},{"$f":"IFERROR(INDEX($G$1:$L$1,MATCH(COLUMNS($G74:G74),$G74:L74,0)),\"\")","v":"پنج شنبه"},{"$f":"IFERROR(INDEX($G$1:$L$1,MATCH(COLUMNS($G74:H74),$G74:L74,0)),\"\")","v":""},{"$f":"IFERROR(INDEX(w!$U74:'w'!$Z74,MATCH(COLUMNS($G74:G74),$G74:L74,0)),\"\")","v":"7-10"},{"$f":"IFERROR(INDEX(w!$U74:'w'!$Z74,MATCH(COLUMNS($G74:H74),$G74:L74,0)),\"\")","v":""},"پنج شنبه - 7-10"," - ","208 - پنج شنبه - 7-10","- -  - "]
[{"$f":"--NOT(ISBLANK(w!U75))","v":0},{"$f":"--NOT(ISBLANK(w!V75))","v":1},{"$f":"--NOT(ISBLANK(w!W75))","v":0},{"$f":"--NOT(ISBLANK(w!X75))","v":1},{"$f":"--NOT(ISBLANK(w!Y75))","v":0},{"$f":"--NOT(ISBLANK(w!Z75))","v":0},{"$f":"IF(A75=1,+COUNTIF($A75:A75,1),\"\")","v":""},{"$f":"IF(B75=1,+COUNTIF($A75:B75,1),\"\")","v":1},{"$f":"IF(C75=1,+COUNTIF($A75:C75,1),\"\")","v":""},{"$f":"IF(D75=1,+COUNTIF($A75:D75,1),\"\")","v":2},{"$f":"IF(E75=1,+COUNTIF($A75:E75,1),\"\")","v":""},{"$f":"IF(F75=1,+COUNTIF($A75:F75,1),\"\")","v":""},{"$f":"w!AH75","v":"213"},{"$f":"w!AI75","v":"213"},{"$f":"IFERROR(INDEX($G$1:$L$1,MATCH(COLUMNS($G75:G75),$G75:L75,0)),\"\")","v":"یکشنبه"},{"$f":"IFERROR(INDEX($G$1:$L$1,MATCH(COLUMNS($G75:H75),$G75:L75,0)),\"\")","v":"سه شنبه"},{"$f":"IFERROR(INDEX(w!$U75:'w'!$Z75,MATCH(COLUMNS($G75:G75),$G75:L75,0)),\"\")","v":"15-17"},{"$f":"IFERROR(INDEX(w!$U75:'w'!$Z75,MATCH(COLUMNS($G75:H75),$G75:L75,0)),\"\")","v":"15-17"},"یکشنبه - 15-17","سه شنبه - 15-17","213 - یکشنبه - 15-17","213 - سه شنبه - 15-17"]
[{"$f":"--NOT(ISBLANK(w!U76))","v":0},{"$f":"--NOT(ISBLANK(w!V76))","v":0},{"$f":"--NOT(ISBLANK(w!W76))","v":0},{"$f":"--NOT(ISBLANK(w!X76))","v":0},{"$f":"--NOT(ISBLANK(w!Y76))","v":1},{"$f":"--NOT(ISBLANK(w!Z76))","v":0},{"$f":"IF(A76=1,+COUNTIF($A76:A76,1),\"\")","v":""},{"$f":"IF(B76=1,+COUNTIF($A76:B76,1),\"\")","v":""},{"$f":"IF(C76=1,+COUNTIF($A76:C76,1),\"\")","v":""},{"$f":"IF(D76=1,+COUNTIF($A76:D76,1),\"\")","v":""},{"$f":"IF(E76=1,+COUNTIF($A76:E76,1),\"\")","v":1},{"$f":"IF(F76=1,+COUNTIF($A76:F76,1),\"\")","v":""},{"$f":"w!AH76","v":"213"},{"$f":"w!AI76","v":"-"},{"$f":"IFERROR(INDEX($G$1:$L$1,MATCH(COLUMNS($G76:G76),$G76:L76,0)),\"\")","v":"چهارشنبه"},{"$f":"IFERROR(INDEX($G$1:$L$1,MATCH(COLUMNS($G76:H76),$G76:L76,0)),\"\")","v":""},{"$f":"IFERROR(INDEX(w!$U76:'w'!$Z76,MATCH(COLUMNS($G76:G76),$G76:L76,0)),\"\")","v":"15-18"},{"$f":"IFERROR(INDEX(w!$U76:'w'!$Z76,MATCH(COLUMNS($G76:H76),$G76:L76,0)),\"\")","v":""},"چهارشنبه - 15-18"," - ","213 - چهارشنبه - 15-18","- -  - "]
[{"$f":"--NOT(ISBLANK(w!U77))","v":0},{"$f":"--NOT(ISBLANK(w!V77))","v":0},{"$f":"--NOT(ISBLANK(w!W77))","v":0},{"$f":"--NOT(ISBLANK(w!X77))","v":1},{"$f":"--NOT(ISBLANK(w!Y77))","v":0},{"$f":"--NOT(ISBLANK(w!Z77))","v":0},{"$f":"IF(A77=1,+COUNTIF($A77:A77,1),\"\")","v":""},{"$f":"IF(B77=1,+COUNTIF($A77:B77,1),\"\")","v":""},{"$f":"IF(C77=1,+COUNTIF($A77:C77,1),\"\")","v":""},{"$f":"IF(D77=1,+COUNTIF($A77:D77,1),\"\")","v":1},{"$f":"IF(E77=1,+COUNTIF($A77:E77,1),\"\")","v":""},{"$f":"IF(F77=1,+COUNTIF($A77:F77,1),\"\")","v":""},{"$f":"w!AH77","v":"210"},{"$f":"w!AI77","v":"-"},{"$f":"IFERROR(INDEX($G$1:$L$1,MATCH(COLUMNS($G77:G77),$G77:L77,0)),\"\")","v":"سه شنبه"},{"$f":"IFERROR(INDEX($G$1:$L$1,MATCH(COLUMNS($G77:H77),$G77:L77,0)),\"\")","v":""},{"$f":"IFERROR(INDEX(w!$U77:'w'!$Z77,MATCH(COLUMNS($G77:G77),$G77:L77,0)),\"\")","v":"7-10"},{"$f":"IFERROR(INDEX(w!$U77:'w'!$Z77,MATCH(COLUMNS($G77:H77),$G77:L77,0)),\"\")","v":""},"سه شنبه - 7-10"," - ","210 - سه شنبه - 7-10","- -  - "]
[{"$f":"--NOT(ISBLANK(w!U78))","v":0},{"$f":"--NOT(ISBLANK(w!V78))","v":0},{"$f":"--NOT(ISBLANK(w!W78))","v":0},{"$f":"--NOT(ISBLANK(w!X78))","v":0},{"$f":"--NOT(ISBLANK(w!Y78))","v":1},{"$f":"--NOT(ISBLANK(w!Z78))","v":0},{"$f":"IF(A78=1,+COUNTIF($A78:A78,1),\"\")","v":""},{"$f":"IF(B78=1,+COUNTIF($A78:B78,1),\"\")","v":""},{"$f":"IF(C78=1,+COUNTIF($A78:C78,1),\"\")","v":""},{"$f":"IF(D78=1,+COUNTIF($A78:D78,1),\"\")","v":""},{"$f":"IF(E78=1,+COUNTIF($A78:E78,1),\"\")","v":1},{"$f":"IF(F78=1,+COUNTIF($A78:F78,1),\"\")","v":""},{"$f":"w!AH78","v":""},{"$f":"w!AI78","v":"-"},{"$f":"IFERROR(INDEX($G$1:$L$1,MATCH(COLUMNS($G78:G78),$G78:L78,0)),\"\")","v":"چهارشنبه"},{"$f":"IFERROR(INDEX($G$1:$L$1,MATCH(COLUMNS($G78:H78),$G78:L78,0)),\"\")","v":""},{"$f":"IFERROR(INDEX(w!$U78:'w'!$Z78,MATCH(COLUMNS($G78:G78),$G78:L78,0)),\"\")","v":"10-13"},{"$f":"IFERROR(INDEX(w!$U78:'w'!$Z78,MATCH(COLUMNS($G78:H78),$G78:L78,0)),\"\")","v":""},"چهارشنبه - 10-13"," - "," - چهارشنبه - 10-13","- -  - "]
[{"$f":"--NOT(ISBLANK(w!U79))","v":0},{"$f":"--NOT(ISBLANK(w!V79))","v":1},{"$f":"--NOT(ISBLANK(w!W79))","v":0},{"$f":"--NOT(ISBLANK(w!X79))","v":1},{"$f":"--NOT(ISBLANK(w!Y79))","v":0},{"$f":"--NOT(ISBLANK(w!Z79))","v":0},{"$f":"IF(A79=1,+COUNTIF($A79:A79,1),\"\")","v":""},{"$f":"IF(B79=1,+COUNTIF($A79:B79,1),\"\")","v":1},{"$f":"IF(C79=1,+COUNTIF($A79:C79,1),\"\")","v":""},{"$f":"IF(D79=1,+COUNTIF($A79:D79,1),\"\")","v":2},{"$f":"IF(E79=1,+COUNTIF($A79:E79,1),\"\")","v":""},{"$f":"IF(F79=1,+COUNTIF($A79:F79,1),\"\")","v":""},{"$f":"w!AH79","v":"213"},{"$f":"w!AI79","v":"210"},{"$f":"IFERROR(INDEX($G$1:$L$1,MATCH(COLUMNS($G79:G79),$G79:L79,0)),\"\")","v":"یکشنبه"},{"$f":"IFERROR(INDEX($G$1:$L$1,MATCH(COLUMNS($G79:H79),$G79:L79,0)),\"\")","v":"سه شنبه"},{"$f":"IFERROR(INDEX(w!$U79:'w'!$Z79,MATCH(COLUMNS($G79:G79),$G79:L79,0)),\"\")","v":"10-12"},{"$f":"IFERROR(INDEX(w!$U79:'w'!$Z79,MATCH(COLUMNS($G79:H79),$G79:L79,0)),\"\")","v":"10-12"},"یکشنبه - 10-12","سه شنبه - 10-12","213 - یکشنبه - 10-12","210 - سه شنبه - 10-12"]
[{"$f":"--NOT(ISBLANK(w!U80))","v":0},{"$f":"--NOT(ISBLANK(w!V80))","v":0},{"$f":"--NOT(ISBLANK(w!W80))","v":0},{"$f":"--NOT(ISBLANK(w!X80))","v":0},{"$f":"--NOT(ISBLANK(w!Y80))","v":0},{"$f":"--NOT(ISBLANK(w!Z80))","v":0},{"$f":"IF(A80=1,+COUNTIF($A80:A80,1),\"\")","v":""},{"$f":"IF(B80=1,+COUNTIF($A80:B80,1),\"\")","v":""},{"$f":"IF(C80=1,+COUNTIF($A80:C80,1),\"\")","v":""},{"$f":"IF(D80=1,+COUNTIF($A80:D80,1),\"\")","v":""},{"$f":"IF(E80=1,+COUNTIF($A80:E80,1),\"\")","v":""},{"$f":"IF(F80=1,+COUNTIF($A80:F80,1),\"\")","v":""},{"$f":"w!AH80","v":""},{"$f":"w!AI80","v":"-"},{"$f":"IFERROR(INDEX($G$1:$L$1,MATCH(COLUMNS($G80:G80),$G80:L80,0)),\"\")","v":""},{"$f":"IFERROR(INDEX($G$1:$L$1,MATCH(COLUMNS($G80:H80),$G80:L80,0)),\"\")","v":""},{"$f":"IFERROR(INDEX(w!$U80:'w'!$Z80,MATCH(COLUMNS($G80:G80),$G80:L80,0)),\"\")","v":""},{"$f":"IFERROR(INDEX(w!$U80:'w'!$Z80,MATCH(COLUMNS($G80:H80),$G80:L80,0)),\"\")","v":""}," - "," - "," -  - ","- -  - "]
[{"$f":"--NOT(ISBLANK(w!U81))","v":0},{"$f":"--NOT(ISBLANK(w!V81))","v":0},{"$f":"--NOT(ISBLANK(w!W81))","v":0},{"$f":"--NOT(ISBLANK(w!X81))","v":0},{"$f":"--NOT(ISBLANK(w!Y81))","v":0},{"$f":"--NOT(ISBLANK(w!Z81))","v":0},{"$f":"IF(A81=1,+COUNTIF($A81:A81,1),\"\")","v":""},{"$f":"IF(B81=1,+COUNTIF($A81:B81,1),\"\")","v":""},{"$f":"IF(C81=1,+COUNTIF($A81:C81,1),\"\")","v":""},{"$f":"IF(D81=1,+COUNTIF($A81:D81,1),\"\")","v":""},{"$f":"IF(E81=1,+COUNTIF($A81:E81,1),\"\")","v":""},{"$f":"IF(F81=1,+COUNTIF($A81:F81,1),\"\")","v":""},{"$f":"w!AH81","v":""},{"$f":"w!AI81","v":"-"},{"$f":"IFERROR(INDEX($G$1:$L$1,MATCH(COLUMNS($G81:G81),$G81:L81,0)),\"\")","v":""},{"$f":"IFERROR(INDEX($G$1:$L$1,MATCH(COLUMNS($G81:H81),$G81:L81,0)),\"\")","v":""},{"$f":"IFERROR(INDEX(w!$U81:'w'!$Z81,MATCH(COLUMNS($G81:G81),$G81:L81,0)),\"\")","v":""},{"$f":"IFERROR(INDEX(w!$U81:'w'!$Z81,MATCH(COLUMNS($G81:H81),$G81:L81,0)),\"\")","v":""}," - "," - "," -  - ","- -  - "]
[{"$f":"--NOT(ISBLANK(w!#REF!))","v":1},{"$f":"--NOT(ISBLANK(w!#REF!))","v":1},{"$f":"--NOT(ISBLANK(w!#REF!))","v":1},{"$f":"--NOT(ISBLANK(w!X82))","v":0},{"$f":"--NOT(ISBLANK(w!Y82))","v":0},{"$f":"--NOT(ISBLANK(w!Z82))","v":0},{"$f":"IF(A82=1,+COUNTIF($A82:A82,1),\"\")","v":1},{"$f":"IF(B82=1,+COUNTIF($A82:B82,1),\"\")","v":2},{"$f":"IF(C82=1,+COUNTIF($A82:C82,1),\"\")","v":3},{"$f":"IF(D82=1,+COUNTIF($A82:D82,1),\"\")","v":""},{"$f":"IF(E82=1,+COUNTIF($A82:E82,1),\"\")","v":""},{"$f":"IF(F82=1,+COUNTIF($A82:F82,1),\"\")","v":""},{"$f":"w!AH82","v":""},{"$f":"w!AI82","v":"-"},{"$f":"IFERROR(INDEX($G$1:$L$1,MATCH(COLUMNS($G82:G82),$G82:L82,0)),\"\")","v":"شنبه"},{"$f":"IFERROR(INDEX($G$1:$L$1,MATCH(COLUMNS($G82:H82),$G82:L82,0)),\"\")","v":"یکشنبه"},{"$f":"IFERROR(INDEX(w!#REF!:w!#REF!,MATCH(COLUMNS($G82:G82),$G82:L82,0)),\"\")","v":""},{"$f":"IFERROR(INDEX(w!#REF!:w!#REF!,MATCH(COLUMNS($G82:H82),$G82:L82,0)),\"\")","v":""},"شنبه - ","یکشنبه - "," - شنبه - ","- - یکشنبه - "]