{"text_format":"1","workbook":"xlsx","n_sheets":7,"sheets":["w","CC","B","ww","Sheet2","R","C"],"not_rendered":{"charts":0,"images":0,"macros":1,"external_links":2,"defined_names":5,"comments":0,"pivot_tables":0},"unopened":[],"bounds":{"document_bytes":16777216,"sheet_cells":100000,"rows_first":2000,"rows_last":500,"rows_between":2000,"halvings":0,"cell_chars":16384,"cell_head_chars":4096},"cells_cut":0,"cells_raw":0,"read":"whole","date_system":"1900"}

{"sheet":"w","index":0,"n_rows":208,"n_cols":36,"rows_kept":208,"cut":false,"hidden":false,"merged":[]}
["ردیف","مقطع","رشته","گرایش","دوره","نام درس","تعداد واحد","نام استاد","نام خانوادگی استاد","ترم برگزاری","دانشجوی ترم چندمی","ترم ورود دانشجو","گروه ارائه دهنده","روز برگزاری","ساعت برگزاری","محل کلاس","کمک مدرس (ویژه آموزش الکترونیکی)","روز امتحان","ساعت امتحان","محل امتحان","شنبه","یکشنبه","دوشنبه","سه شنبه","چهارشنبه","پنج شنبه","توضیحات","روز 1","روز2","روز3","ساعت 1","ساعت 2","ساعت 3","کلاس1","کلاس2","عنوان کامل"]
[{"$f":"ROWS(A$2:C2)","v":1},"كارشناسي ارشد","علوم اقتصادی","برنامه ريزي سيستمهاي اقتصادي","روزانه","اقتصاد سنجي ( جبرانی )","3",null,"شوال پور",3982,"ترم 02",3981,"پیشرفت اقتصادی",{"$f":"CONCATENATE('C'!O2,CHAR(10),'C'!P2)","v":"شنبه\nسه شنبه"},{"$f":"CONCATENATE('C'!Q2,CHAR(10),'C'!R2)","v":"13-15\n10-12"},{"$f":"CONCATENATE(AH2,CHAR(10),AI2)","v":"207\n208"},null,"99/03/25","8",null,"13-15",null,null,"10-12",null,null,null,"شنبه","سه شنبه",null,{"$f":"'C'!Q2","v":"13-15"},{"$f":"'C'!R2","v":"10-12"},null,207,"208",{"$f":"CONCATENATE(\"رشته: \",C2,\"-\",\" گرایش: \",D2,\" - \",B2,\" - دانشجویان \",K2,\" - \",E2)","v":"رشته: علوم اقتصادی- گرایش: برنامه ريزي سيستمهاي اقتصادي - كارشناسي ارشد - دانشجویان ترم 02 - روزانه"}]
[{"$f":"ROWS(A$2:C3)","v":2},"كارشناسي ارشد","علوم اقتصادی","برنامه ريزي سيستمهاي اقتصادي","روزانه","اقتصاد كلان",{"$f":"VLOOKUP(F3,[2]Sheet1!$M:$N,2,FALSE)","v":4},null,"رفیعی",3982,"ترم 02",3981,"پیشرفت اقتصادی",{"$f":"CONCATENATE('C'!O3,CHAR(10),'C'!P3)","v":"شنبه\nسه شنبه"},{"$f":"CONCATENATE('C'!Q3,CHAR(10),'C'!R3)","v":"10-12\n15-17"},"207\n208",null,"99/03/27","8",null,"10-12",null,null,"15-17",null,null,null,{"$f":"'C'!O3","v":"شنبه"},{"$f":"'C'!P3","v":"سه شنبه"},null,{"$f":"'C'!Q3","v":"10-12"},{"$f":"'C'!R3","v":"15-17"},null,"207","208","رشته: علوم اقتصادی- گرایش: برنامه ريزي سيستمهاي اقتصادي - كارشناسي ارشد - دانشجویان ترم 02 - روزانه"]
[{"$f":"ROWS(A$2:C4)","v":3},"كارشناسي ارشد","علوم اقتصادی","برنامه ريزي سيستمهاي اقتصادي","روزانه","تحلیل تصمیم گیری",3,null,"کرمانی",3982,"ترم 02",3981,"پیشرفت اقتصادی",{"$f":"CONCATENATE('C'!O4,CHAR(10),'C'!P4)","v":"شنبه\nسه شنبه"},{"$f":"CONCATENATE('C'!Q4,CHAR(10),'C'!R4)","v":"15-17\n13-15"},"207\n208",null,"99/03/31","8",null,"15-17",null,null,"13-15",null,null,null,{"$f":"'C'!O4","v":"شنبه"},{"$f":"'C'!P4","v":"سه شنبه"},null,{"$f":"'C'!Q4","v":"15-17"},{"$f":"'C'!R4","v":"13-15"},null,"207","208","رشته: علوم اقتصادی- گرایش: برنامه ريزي سيستمهاي اقتصادي - كارشناسي ارشد - دانشجویان ترم 02 - روزانه"]
[{"$f":"ROWS(A$2:C5)","v":4},"كارشناسي ارشد","علوم اقتصادی","برنامه ريزي سيستمهاي اقتصادي","روزانه","سيستمهاي ديناميكي1",{"$f":"VLOOKUP(F5,[2]Sheet1!$M:$N,2,FALSE)","v":3},null,"پارسانژاد",3982,"ترم 02",3981,"پیشرفت اقتصادی",{"$f":"CONCATENATE('C'!O5,CHAR(10),'C'!P5)","v":"شنبه\nسه شنبه"},{"$f":"CONCATENATE('C'!Q5,CHAR(10),'C'!R5)","v":"8-10\n8-10"},"207\n207",null,"99/04/04","8",null,"8-10",null,null,"8-10",null,null,null,{"$f":"'C'!O5","v":"شنبه"},{"$f":"'C'!P5","v":"سه شنبه"},null,{"$f":"'C'!Q5","v":"8-10"},{"$f":"'C'!R5","v":"8-10"},null,"207","207","رشته: علوم اقتصادی- گرایش: برنامه ريزي سيستمهاي اقتصادي - كارشناسي ارشد - دانشجویان ترم 02 - روزانه"]
[{"$f":"ROWS(A$2:C6)","v":5},"كارشناسي ارشد","علوم اقتصادی","برنامه ريزي سيستمهاي اقتصادي","روزانه","پایان نامه",6,null,null,3982,"ترم 04 و بیشتر","3971 و قبل تر","پیشرفت اقتصادی",{"$f":"CONCATENATE('C'!O6,CHAR(10),'C'!P6)","v":"\n"},{"$f":"CONCATENATE('C'!Q6,CHAR(10),'C'!R6)","v":"\n"},"\n-",null,null,null,null,null,null,null,null,null,null,null,{"$f":"'C'!O6","v":""},{"$f":"'C'!P6","v":""},null,{"$f":"'C'!Q6","v":""},{"$f":"'C'!R6","v":""},null,"","-","رشته: علوم اقتصادی- گرایش: برنامه ريزي سيستمهاي اقتصادي - كارشناسي ارشد - دانشجویان ترم 04 و بیشتر - روزانه"]
{"$rows_left_out":203}
{"sheet":"CC","index":1,"n_rows":26,"n_cols":9,"rows_kept":26,"cut":false,"hidden":false,"merged":[]}
[null,"برنامه هفتگی کلاس:",207,"نیمسال دوم 98-99",null,null,null,null,"کلاس"]
["روز/ساعت","7-8","8-10","10-12","13-15","15-17","17-19",null,207]
["شنبه",{"$f":"IFERROR(VLOOKUP(B10,Sheet2!$A:$B,2,FALSE),\"\")","v":""},{"$f":"IFERROR(VLOOKUP(C10,Sheet2!$A:$B,2,FALSE),\"\")","v":"سيستمهاي ديناميكي1\nروزانه - پارسانژاد"},{"$f":"IFERROR(VLOOKUP(D10,Sheet2!$A:$B,2,FALSE),\"\")","v":"اقتصاد كلان\nروزانه - رفیعی"},{"$f":"IFERROR(VLOOKUP(E10,Sheet2!$A:$B,2,FALSE),\"\")","v":"اقتصاد سنجي ( جبرانی )\nروزانه - شوال پور"},{"$f":"IFERROR(VLOOKUP(F10,Sheet2!$A:$B,2,FALSE),\"\")","v":"تحلیل تصمیم گیری\nروزانه - کرمانی"},{"$f":"IFERROR(VLOOKUP(G10,Sheet2!$A:$B,2,FALSE),\"\")","v":""},null,208]
["یکشنبه",{"$f":"IFERROR(VLOOKUP(B11,Sheet2!$A:$B,2,FALSE),\"\")","v":""},{"$f":"IFERROR(VLOOKUP(C11,Sheet2!$A:$B,2,FALSE),\"\")","v":"اقتصاد كلان پيشرفته\nروزانه - میرزامحمدی"},{"$f":"IFERROR(VLOOKUP(D11,Sheet2!$A:$B,2,FALSE),\"\")","v":"داده كاوي: مدلها، الگوريتمها و كاربردها\nروزانه - رسولی"},{"$f":"IFERROR(VLOOKUP(E11,Sheet2!$A:$B,2,FALSE),\"\")","v":"مدلسازي پوياييهاي سيستم\nروزانه - پارسانژاد"},{"$f":"IFERROR(VLOOKUP(F11,Sheet2!$A:$B,2,FALSE),\"\")","v":"مفاهیم و مدلهای تحلیل شبکه های اجتماعی\nروزانه - کرمانی"},{"$f":"IFERROR(VLOOKUP(G11,Sheet2!$A:$B,2,FALSE),\"\")","v":""},null,209]
["دوشنبه",{"$f":"IFERROR(VLOOKUP(B12,Sheet2!$A:$B,2,FALSE),\"\")","v":""},{"$f":"IFERROR(VLOOKUP(C12,Sheet2!$A:$B,2,FALSE),\"\")","v":"مدلهاي كسب و كار الكترونيك\nروزانه - صالحی"},{"$f":"IFERROR(VLOOKUP(D12,Sheet2!$A:$B,2,FALSE),\"\")","v":"مباني تئوري و فلسفي سيستمهاي اطلاعاتي\nروزانه - رفیعی آتانی"},{"$f":"IFERROR(VLOOKUP(E12,Sheet2!$A:$B,2,FALSE),\"\")","v":""},{"$f":"IFERROR(VLOOKUP(F12,Sheet2!$A:$B,2,FALSE),\"\")","v":"مديريت امنيت فناوري اطلاعات\nروزانه - خانی زاد"},{"$f":"IFERROR(VLOOKUP(G12,Sheet2!$A:$B,2,FALSE),\"\")","v":""},null,210]
["سه شنبه",{"$f":"IFERROR(VLOOKUP(B13,Sheet2!$A:$B,2,FALSE),\"\")","v":""},{"$f":"IFERROR(VLOOKUP(C13,Sheet2!$A:$B,2,FALSE),\"\")","v":"سيستمهاي ديناميكي1\nروزانه - پارسانژاد"},{"$f":"IFERROR(VLOOKUP(D13,Sheet2!$A:$B,2,FALSE),\"\")","v":"داده كاوي: مدلها، الگوريتمها و كاربردها\nروزانه - رسولی"},{"$f":"IFERROR(VLOOKUP(E13,Sheet2!$A:$B,2,FALSE),\"\")","v":"مدلسازي پوياييهاي سيستم\nروزانه - پارسانژاد"},{"$f":"IFERROR(VLOOKUP(F13,Sheet2!$A:$B,2,FALSE),\"\")","v":"مفاهیم و مدلهای تحلیل شبکه های اجتماعی\nروزانه - کرمانی"},{"$f":"IFERROR(VLOOKUP(G13,Sheet2!$A:$B,2,FALSE),\"\")","v":""},null,213]
{"$rows_left_out":21}
{"sheet":"B","index":2,"n_rows":83,"n_cols":24,"rows_kept":83,"cut":false,"hidden":false,"merged":[]}
["عنوان کامل","if found","frecouncy","searchable list","رشته: مديريت كسب و كار- گرایش: استراتژي - كارشناسي ارشد - دانشجویان ترم 04 - روزانه",null,null,null,null,null,null,null,null,null,null,null,null,null,null,null,null,null,null,"عنوان کامل"]
["رشته: علوم اقتصادی- گرایش: برنامه ريزي سيستمهاي اقتصادي - كارشناسي ارشد - دانشجویان ترم 02 - روزانه",{"$f":"--ISNUMBER(SEARCH($E$1,X:X))","v":0},{"$f":"IF(B2=1,+COUNTIF($B$2:$B2,1),\"\")","v":""},{"$f":"IFERROR(INDEX($X$2:$X$400,MATCH(ROWS($C$2:$C2),$C$2:$C400,0)),\"\")","v":"رشته: مديريت كسب و كار- گرایش: استراتژي - كارشناسي ارشد - دانشجویان ترم 04 - روزانه"},null,null,null,null,null,null,{"$f":"ROWS($C$2:$C2)","v":1},null,null,{"$f":"E1","v":"رشته: مديريت كسب و كار- گرایش: استراتژي - كارشناسي ارشد - دانشجویان ترم 04 - روزانه"},null,null,null,null,null,null,null,null,null,{"$f":"CONCATENATE(\"رشته: \",w!C2,\"-\",\" گرایش: \",w!D2,\" - \",w!B2,\" - دانشجویان \",w!K2,\" - \",w!E2)","v":"رشته: علوم اقتصادی- گرایش: برنامه ريزي سيستمهاي اقتصادي - كارشناسي ارشد - دانشجویان ترم 02 - روزانه"}]
["رشته: علوم اقتصادی- گرایش: برنامه ريزي سيستمهاي اقتصادي - كارشناسي ارشد - دانشجویان ترم 04 و بیشتر - روزانه",{"$f":"--ISNUMBER(SEARCH($E$1,X:X))","v":0},{"$f":"IF(B3=1,+COUNTIF($B$2:$B3,1),\"\")","v":""},{"$f":"IFERROR(INDEX($X$2:$X$400,MATCH(ROWS($C$2:$C3),$C$2:$C401,0)),\"\")","v":"رشته: مديريت كسب و كار- گرایش: استراتژي - كارشناسي ارشد - دانشجویان ترم 04 - روزانه"},null,null,null,null,null,null,{"$f":"ROWS($C$2:$C3)","v":2},null,null,null,null,null,null,"مشخصات ارائه",null,null,"زمان امتحان",null,null,{"$f":"CONCATENATE(\"رشته: \",w!C3,\"-\",\" گرایش: \",w!D3,\" - \",w!B3,\" - دانشجویان \",w!K3,\" - \",w!E3)","v":"رشته: علوم اقتصادی- گرایش: برنامه ريزي سيستمهاي اقتصادي - كارشناسي ارشد - دانشجویان ترم 02 - روزانه"}]
["رشته: علوم اقتصادی- گرایش: توسعه اقتصادي و برنامه ريزي - كارشناسي ارشد - دانشجویان ترم 02 - روزانه",0,{"$f":"IF(B4=1,+COUNTIF($B$2:$B4,1),\"\")","v":""},{"$f":"IFERROR(INDEX($X$2:$X$400,MATCH(ROWS($C$2:$C4),$C$2:$C402,0)),\"\")","v":"رشته: مديريت كسب و كار- گرایش: استراتژي - كارشناسي ارشد - دانشجویان ترم 04 - روزانه"},null,null,null,null,null,null,{"$f":"ROWS($C$2:$C4)","v":3},null,null,"نام درس"," واحد","استاد","روز","ساعت","کلاس","تاریخ","ساعت","توضیحات",null,{"$f":"CONCATENATE(\"رشته: \",w!C4,\"-\",\" گرایش: \",w!D4,\" - \",w!B4,\" - دانشجویان \",w!K4,\" - \",w!E4)","v":"رشته: علوم اقتصادی- گرایش: برنامه ريزي سيستمهاي اقتصادي - كارشناسي ارشد - دانشجویان ترم 02 - روزانه"}]
["رشته: علوم اقتصادی- گرایش: توسعه اقتصادي و برنامه ريزي - كارشناسي ارشد - دانشجویان ترم 04 و بیشتر - روزانه",0,{"$f":"IF(B5=1,+COUNTIF($B$2:$B5,1),\"\")","v":""},{"$f":"IFERROR(INDEX($X$2:$X$400,MATCH(ROWS($C$2:$C5),$C$2:$C403,0)),\"\")","v":""},null,null,null,null,null,null,{"$f":"ROWS($C$2:$C5)","v":4},null,null,{"$f":"IFERROR(INDEX(w!F$2:F$421,MATCH(ROWS($C$2:$C2),$C$2:$C400,0)),\"\")","v":"مدیریت استراتژیک پیشرفته"},{"$f":"IFERROR(INDEX(w!G$2:G$421,MATCH(ROWS($C$2:$C2),$C$2:$C400,0)),\"\")","v":"3"},{"$f":"IFERROR(INDEX(w!I$2:I$421,MATCH(ROWS($C$2:$C2),$C$2:$C400,0)),\"\")","v":"حمیدی زاده"},{"$f":"IFERROR(INDEX(w!N$2:N$421,MATCH(ROWS($C$2:$C2),$C$2:$C400,0)),\"\")","v":"یکشنبه\nسه شنبه"},{"$f":"IFERROR(INDEX(w!O$2:O$421,MATCH(ROWS($C$2:$C2),$C$2:$C400,0)),\"\")","v":"15-17\n15-17"},{"$f":"IFERROR(INDEX(w!P$2:P$421,MATCH(ROWS($C$2:$C2),$C$2:$C400,0)),\"\")","v":"208\n-"},{"$f":"IFERROR(INDEX(w!R$2:R$421,MATCH(ROWS($C$2:$C2),$C$2:$C400,0)),\"\")","v":"99/04/04"},{"$f":"IFERROR(INDEX(w!S$2:S$421,MATCH(ROWS($C$2:$C2),$C$2:$C400,0)),\"\")","v":"8"},{"$f":"IFERROR(INDEX(w!AA$2:AA$421,MATCH(ROWS($C$2:$C2),$C$2:$C400,0)),\"\")","v":0},null,{"$f":"CONCATENATE(\"رشته: \",w!C5,\"-\",\" گرایش: \",w!D5,\" - \",w!B5,\" - دانشجویان \",w!K5,\" - \",w!E5)","v":"رشته: علوم اقتصادی- گرایش: برنامه ريزي سيستمهاي اقتصادي - كارشناسي ارشد - دانشجویان ترم 02 - روزانه"}]
["رشته: مهندسي صنايع- گرایش: سيستمهاي كلان - كارشناسي ارشد - دانشجویان ترم 02 - روزانه",0,{"$f":"IF(B6=1,+COUNTIF($B$2:$B6,1),\"\")","v":""},{"$f":"IFERROR(INDEX($X$2:$X$400,MATCH(ROWS($C$2:$C6),$C$2:$C404,0)),\"\")","v":""},null,null,null,null,null,null,{"$f":"ROWS($C$2:$C6)","v":5},null,null,{"$f":"IFERROR(INDEX(w!F$2:F$421,MATCH(ROWS($C$2:$C3),$C$2:$C401,0)),\"\")","v":"مدیریت اتحادهای اسراتژیک"},{"$f":"IFERROR(INDEX(w!G$2:G$421,MATCH(ROWS($C$2:$C3),$C$2:$C401,0)),\"\")","v":"3"},{"$f":"IFERROR(INDEX(w!I$2:I$421,MATCH(ROWS($C$2:$C3),$C$2:$C401,0)),\"\")","v":"علی احمدی"},{"$f":"IFERROR(INDEX(w!N$2:N$421,MATCH(ROWS($C$2:$C3),$C$2:$C401,0)),\"\")","v":"سه شنبه\n"},{"$f":"IFERROR(INDEX(w!O$2:O$421,MATCH(ROWS($C$2:$C3),$C$2:$C401,0)),\"\")","v":"7-10\n"},{"$f":"IFERROR(INDEX(w!P$2:P$421,MATCH(ROWS($C$2:$C3),$C$2:$C401,0)),\"\")","v":"213\n-"},{"$f":"IFERROR(INDEX(w!R$2:R$421,MATCH(ROWS($C$2:$C3),$C$2:$C401,0)),\"\")","v":"99/03/24"},{"$f":"IFERROR(INDEX(w!S$2:S$421,MATCH(ROWS($C$2:$C3),$C$2:$C401,0)),\"\")","v":10},{"$f":"IFERROR(INDEX(w!AA$2:AA$421,MATCH(ROWS($C$2:$C3),$C$2:$C401,0)),\"\")","v":0},null,{"$f":"CONCATENATE(\"رشته: \",w!C6,\"-\",\" گرایش: \",w!D6,\" - \",w!B6,\" - دانشجویان \",w!K6,\" - \",w!E6)","v":"رشته: علوم اقتصادی- گرایش: برنامه ريزي سيستمهاي اقتصادي - كارشناسي ارشد - دانشجویان ترم 04 و بیشتر - روزانه"}]
{"$rows_left_out":78}
{"sheet":"ww","index":3,"n_rows":285,"n_cols":9,"rows_kept":285,"cut":false,"hidden":false,"merged":[]}
["رشته: علوم اقتصادی- گرایش: برنامه ريزي سيستمهاي اقتصادي - كارشناسي ارشد - دانشجویان ترم 02 - روزانه"]
[null,null,null,null,"مشخصات ارائه",null,null,"زمان امتحان"]
["نام درس"," واحد","استاد","روز","ساعت","کلاس","تاریخ","ساعت","توضیحات"]
["اقتصاد سنجي ( جبرانی )","3","شوال پور","شنبه\nسه شنبه","13-15\n10-12","207\n208","99/03/25","8",0]
["اقتصاد كلان",4,"رفیعی","شنبه\nسه شنبه","10-12\n15-17","207\n208","99/03/27","8",0]
["تحلیل تصمیم گیری",3,"کرمانی","شنبه\nسه شنبه","15-17\n13-15","207\n208","99/03/31","8",0]
{"$rows_left_out":280}
{"sheet":"Sheet2","index":4,"n_rows":161,"n_cols":13,"rows_kept":161,"cut":false,"hidden":false,"merged":[]}
[null,null,"رشته","گرایش","دوره","درس","استاد","روز",null,"ساعت",null,"کلاس"]
[{"$f":"CONCATENATE(H2,\" - \",J2,\" - \",L2)","v":"شنبه - 13-15 - 207"},{"$f":"CONCATENATE(F2,CHAR(10),E2,\" - \",G2)","v":"اقتصاد سنجي ( جبرانی )\nروزانه - شوال پور"},{"$f":"w!C2","v":"علوم اقتصادی"},{"$f":"w!D2","v":"برنامه ريزي سيستمهاي اقتصادي"},{"$f":"w!E2","v":"روزانه"},{"$f":"w!F2","v":"اقتصاد سنجي ( جبرانی )"},{"$f":"w!I2","v":"شوال پور"},{"$f":"w!AB2","v":"شنبه"},{"$f":"w!AC2","v":"سه شنبه"},{"$f":"w!AE2","v":"13-15"},{"$f":"w!AF2","v":"10-12"},{"$f":"w!AH2","v":207},{"$f":"w!AI2","v":"208"}]
["شنبه - 10-12 - 207","اقتصاد كلان\nروزانه - رفیعی",{"$f":"w!C3","v":"علوم اقتصادی"},{"$f":"w!D3","v":"برنامه ريزي سيستمهاي اقتصادي"},{"$f":"w!E3","v":"روزانه"},{"$f":"w!F3","v":"اقتصاد كلان"},{"$f":"w!I3","v":"رفیعی"},{"$f":"w!AB3","v":"شنبه"},{"$f":"w!AC3","v":"سه شنبه"},{"$f":"w!AE3","v":"10-12"},{"$f":"w!AF3","v":"15-17"},{"$f":"w!AH3","v":"207"},{"$f":"w!AI3","v":"208"}]
["شنبه - 15-17 - 207","تحلیل تصمیم گیری\nروزانه - کرمانی",{"$f":"w!C4","v":"علوم اقتصادی"},{"$f":"w!D4","v":"برنامه ريزي سيستمهاي اقتصادي"},{"$f":"w!E4","v":"روزانه"},{"$f":"w!F4","v":"تحلیل تصمیم گیری"},{"$f":"w!I4","v":"کرمانی"},{"$f":"w!AB4","v":"شنبه"},{"$f":"w!AC4","v":"سه شنبه"},{"$f":"w!AE4","v":"15-17"},{"$f":"w!AF4","v":"13-15"},{"$f":"w!AH4","v":"207"},{"$f":"w!AI4","v":"208"}]
["شنبه - 8-10 - 207","سيستمهاي ديناميكي1\nروزانه - پارسانژاد",{"$f":"w!C5","v":"علوم اقتصادی"},{"$f":"w!D5","v":"برنامه ريزي سيستمهاي اقتصادي"},{"$f":"w!E5","v":"روزانه"},{"$f":"w!F5","v":"سيستمهاي ديناميكي1"},{"$f":"w!I5","v":"پارسانژاد"},{"$f":"w!AB5","v":"شنبه"},{"$f":"w!AC5","v":"سه شنبه"},{"$f":"w!AE5","v":"8-10"},{"$f":"w!AF5","v":"8-10"},{"$f":"w!AH5","v":"207"},{"$f":"w!AI5","v":"207"}]
[" -  - ","پایان نامه\nروزانه - 0",{"$f":"w!C6","v":"علوم اقتصادی"},{"$f":"w!D6","v":"برنامه ريزي سيستمهاي اقتصادي"},{"$f":"w!E6","v":"روزانه"},{"$f":"w!F6","v":"پایان نامه"},{"$f":"w!I6","v":0},{"$f":"w!AB6","v":""},{"$f":"w!AC6","v":""},{"$f":"w!AE6","v":""},{"$f":"w!AF6","v":""},{"$f":"w!AH6","v":""},{"$f":"w!AI6","v":"-"}]
{"$rows_left_out":156}
{"sheet":"R","index":5,"n_rows":29,"n_cols":1,"rows_kept":29,"cut":false,"hidden":false,"merged":[]}
["عنوان کامل"]
["رشته: علوم اقتصادی- گرایش: برنامه ريزي سيستمهاي اقتصادي - كارشناسي ارشد - دانشجویان ترم 02 - روزانه"]
["رشته: علوم اقتصادی- گرایش: برنامه ريزي سيستمهاي اقتصادي - كارشناسي ارشد - دانشجویان ترم 04 و بیشتر - روزانه"]
["رشته: علوم اقتصادی- گرایش: توسعه اقتصادي و برنامه ريزي - كارشناسي ارشد - دانشجویان ترم 02 - روزانه"]
["رشته: علوم اقتصادی- گرایش: توسعه اقتصادي و برنامه ريزي - كارشناسي ارشد - دانشجویان ترم 04 و بیشتر - روزانه"]
["رشته: مهندسي صنايع- گرایش: سيستمهاي كلان - كارشناسي ارشد - دانشجویان ترم 02 - روزانه"]
{"$rows_left_out":24}
{"sheet":"C","index":6,"n_rows":82,"n_cols":22,"rows_kept":82,"cut":false,"hidden":false,"merged":[]}
["شنبه","یکشنبه","دوشنبه","سه شنبه","چهارشنبه","پنج شنبه","شنبه","یکشنبه","دوشنبه","سه شنبه","چهارشنبه","پنج شنبه","کلاس1","کلاس2","روز1","روز2","ساعت1","ساعت2","زمان 1","زمان 2",1,2]
[{"$f":"--NOT(ISBLANK(w!U2))","v":1},{"$f":"--NOT(ISBLANK(w!V2))","v":0},{"$f":"--NOT(ISBLANK(w!W2))","v":0},{"$f":"--NOT(ISBLANK(w!X2))","v":1},{"$f":"--NOT(ISBLANK(w!Y2))","v":0},{"$f":"--NOT(ISBLANK(w!Z2))","v":0},{"$f":"IF(A2=1,+COUNTIF($A2:A2,1),\"\")","v":1},{"$f":"IF(B2=1,+COUNTIF($A2:B2,1),\"\")","v":""},{"$f":"IF(C2=1,+COUNTIF($A2:C2,1),\"\")","v":""},{"$f":"IF(D2=1,+COUNTIF($A2:D2,1),\"\")","v":2},{"$f":"IF(E2=1,+COUNTIF($A2:E2,1),\"\")","v":""},{"$f":"IF(F2=1,+COUNTIF($A2:F2,1),\"\")","v":""},{"$f":"w!AH2","v":207},{"$f":"w!AI2","v":"208"},{"$f":"IFERROR(INDEX($G$1:$H$1,MATCH(COLUMNS($G2:G2),$G2:L2,0)),\"\")","v":"شنبه"},{"$f":"IFERROR(INDEX($G$1:$L$1,MATCH(COLUMNS($G2:H2),$G2:L2,0)),\"\")","v":"سه شنبه"},{"$f":"IFERROR(INDEX(w!$U2:'w'!$Z2,MATCH(COLUMNS($G2:G2),$G2:L2,0)),\"\")","v":"13-15"},{"$f":"IFERROR(INDEX(w!$U2:'w'!$Z2,MATCH(COLUMNS($G2:H2),$G2:L2,0)),\"\")","v":"10-12"},{"$f":"CONCATENATE(O2,\" - \",Q2)","v":"شنبه - 13-15"},{"$f":"CONCATENATE(P2,\" - \",R2)","v":"سه شنبه - 10-12"},{"$f":"CONCATENATE(M2,\" - \",O2,\" - \",Q2)","v":"207 - شنبه - 13-15"},{"$f":"CONCATENATE(N2,\" - \",P2,\" - \",R2)","v":"208 - سه شنبه - 10-12"}]
[{"$f":"--NOT(ISBLANK(w!U3))","v":1},{"$f":"--NOT(ISBLANK(w!V3))","v":0},{"$f":"--NOT(ISBLANK(w!W3))","v":0},{"$f":"--NOT(ISBLANK(w!X3))","v":1},{"$f":"--NOT(ISBLANK(w!Y3))","v":0},{"$f":"--NOT(ISBLANK(w!Z3))","v":0},{"$f":"IF(A3=1,+COUNTIF($A3:A3,1),\"\")","v":1},{"$f":"IF(B3=1,+COUNTIF($A3:B3,1),\"\")","v":""},{"$f":"IF(C3=1,+COUNTIF($A3:C3,1),\"\")","v":""},{"$f":"IF(D3=1,+COUNTIF($A3:D3,1),\"\")","v":2},{"$f":"IF(E3=1,+COUNTIF($A3:E3,1),\"\")","v":""},{"$f":"IF(F3=1,+COUNTIF($A3:F3,1),\"\")","v":""},{"$f":"w!AH3","v":"207"},{"$f":"w!AI3","v":"208"},{"$f":"IFERROR(INDEX($G$1:$H$1,MATCH(COLUMNS($G3:G3),$G3:L3,0)),\"\")","v":"شنبه"},{"$f":"IFERROR(INDEX($G$1:$L$1,MATCH(COLUMNS($G3:H3),$G3:L3,0)),\"\")","v":"سه شنبه"},{"$f":"IFERROR(INDEX(w!$U3:'w'!$Z3,MATCH(COLUMNS($G3:G3),$G3:L3,0)),\"\")","v":"10-12"},{"$f":"IFERROR(INDEX(w!$U3:'w'!$Z3,MATCH(COLUMNS($G3:H3),$G3:L3,0)),\"\")","v":"15-17"},"شنبه - 10-12","سه شنبه - 15-17",{"$f":"CONCATENATE(M3,\" - \",O3,\" - \",Q3)","v":"207 - شنبه - 10-12"},{"$f":"CONCATENATE(N3,\" - \",P3,\" - \",R3)","v":"208 - سه شنبه - 15-17"}]
[{"$f":"--NOT(ISBLANK(w!U4))","v":1},{"$f":"--NOT(ISBLANK(w!V4))","v":0},{"$f":"--NOT(ISBLANK(w!W4))","v":0},{"$f":"--NOT(ISBLANK(w!X4))","v":1},{"$f":"--NOT(ISBLANK(w!Y4))","v":0},{"$f":"--NOT(ISBLANK(w!Z4))","v":0},{"$f":"IF(A4=1,+COUNTIF($A4:A4,1),\"\")","v":1},{"$f":"IF(B4=1,+COUNTIF($A4:B4,1),\"\")","v":""},{"$f":"IF(C4=1,+COUNTIF($A4:C4,1),\"\")","v":""},{"$f":"IF(D4=1,+COUNTIF($A4:D4,1),\"\")","v":2},{"$f":"IF(E4=1,+COUNTIF($A4:E4,1),\"\")","v":""},{"$f":"IF(F4=1,+COUNTIF($A4:F4,1),\"\")","v":""},{"$f":"w!AH4","v":"207"},{"$f":"w!AI4","v":"208"},{"$f":"IFERROR(INDEX($G$1:$H$1,MATCH(COLUMNS($G4:G4),$G4:L4,0)),\"\")","v":"شنبه"},{"$f":"IFERROR(INDEX($G$1:$L$1,MATCH(COLUMNS($G4:H4),$G4:L4,0)),\"\")","v":"سه شنبه"},{"$f":"IFERROR(INDEX(w!$U4:'w'!$Z4,MATCH(COLUMNS($G4:G4),$G4:L4,0)),\"\")","v":"15-17"},{"$f":"IFERROR(INDEX(w!$U4:'w'!$Z4,MATCH(COLUMNS($G4:H4),$G4:L4,0)),\"\")","v":"13-15"},"شنبه - 15-17","سه شنبه - 13-15","207 - شنبه - 15-17","208 - سه شنبه - 13-15"]
[{"$f":"--NOT(ISBLANK(w!U5))","v":1},{"$f":"--NOT(ISBLANK(w!V5))","v":0},{"$f":"--NOT(ISBLANK(w!W5))","v":0},{"$f":"--NOT(ISBLANK(w!X5))","v":1},{"$f":"--NOT(ISBLANK(w!Y5))","v":0},{"$f":"--NOT(ISBLANK(w!Z5))","v":0},{"$f":"IF(A5=1,+COUNTIF($A5:A5,1),\"\")","v":1},{"$f":"IF(B5=1,+COUNTIF($A5:B5,1),\"\")","v":""},{"$f":"IF(C5=1,+COUNTIF($A5:C5,1),\"\")","v":""},{"$f":"IF(D5=1,+COUNTIF($A5:D5,1),\"\")","v":2},{"$f":"IF(E5=1,+COUNTIF($A5:E5,1),\"\")","v":""},{"$f":"IF(F5=1,+COUNTIF($A5:F5,1),\"\")","v":""},{"$f":"w!AH5","v":"207"},{"$f":"w!AI5","v":"207"},{"$f":"IFERROR(INDEX($G$1:$H$1,MATCH(COLUMNS($G5:G5),$G5:L5,0)),\"\")","v":"شنبه"},{"$f":"IFERROR(INDEX($G$1:$L$1,MATCH(COLUMNS($G5:H5),$G5:L5,0)),\"\")","v":"سه شنبه"},{"$f":"IFERROR(INDEX(w!$U5:'w'!$Z5,MATCH(COLUMNS($G5:G5),$G5:L5,0)),\"\")","v":"8-10"},{"$f":"IFERROR(INDEX(w!$U5:'w'!$Z5,MATCH(COLUMNS($G5:H5),$G5:L5,0)),\"\")","v":"8-10"},"شنبه - 8-10","سه شنبه - 8-10","207 - شنبه - 8-10","207 - سه شنبه - 8-10"]
[{"$f":"--NOT(ISBLANK(w!U6))","v":0},{"$f":"--NOT(ISBLANK(w!V6))","v":0},{"$f":"--NOT(ISBLANK(w!W6))","v":0},{"$f":"--NOT(ISBLANK(w!X6))","v":0},{"$f":"--NOT(ISBLANK(w!Y6))","v":0},{"$f":"--NOT(ISBLANK(w!Z6))","v":0},{"$f":"IF(A6=1,+COUNTIF($A6:A6,1),\"\")","v":""},{"$f":"IF(B6=1,+COUNTIF($A6:B6,1),\"\")","v":""},{"$f":"IF(C6=1,+COUNTIF($A6:C6,1),\"\")","v":""},{"$f":"IF(D6=1,+COUNTIF($A6:D6,1),\"\")","v":""},{"$f":"IF(E6=1,+COUNTIF($A6:E6,1),\"\")","v":""},{"$f":"IF(F6=1,+COUNTIF($A6:F6,1),\"\")","v":""},{"$f":"w!AH6","v":""},{"$f":"w!AI6","v":"-"},{"$f":"IFERROR(INDEX($G$1:$H$1,MATCH(COLUMNS($G6:G6),$G6:L6,0)),\"\")","v":""},{"$f":"IFERROR(INDEX($G$1:$L$1,MATCH(COLUMNS($G6:H6),$G6:L6,0)),\"\")","v":""},{"$f":"IFERROR(INDEX(w!$U6:'w'!$Z6,MATCH(COLUMNS($G6:G6),$G6:L6,0)),\"\")","v":""},{"$f":"IFERROR(INDEX(w!$U6:'w'!$Z6,MATCH(COLUMNS($G6:H6),$G6:L6,0)),\"\")","v":""}," - "," - "," -  - ","- -  - "]
{"$rows_left_out":76}